BDBM50344813 5-(2,5-dichlorophenyl)-N-(2-ethyl-6-methylphenyl)furan-2-carboxamide::CHEMBL1779901
SMILES: CCc1cccc(C)c1NC(=O)c1ccc(o1)-c1cc(Cl)ccc1Cl
InChI Key: InChIKey=MXXYDKSSTRFQIF-UHFFFAOYSA-N
Data: 1 IC50
Activity Spreadsheet -- Enzyme Inhibition Constant Data from BindingDB
Found 1 hit for monomerid = 50344813
Trg + Lig
Ki
nM
ΔG°
kcal/mole
IC50
nM
Kd
nM
EC50/IC50
nM
koff
s-1
kon
M-1s-1
pHTemp
°C
Sphingosine 1-phosphate receptor 4
(Homo sapiens (Human))
BDBM50344813
(5-(2,5-dichlorophenyl)-N-(2-ethyl-6-methylphenyl)f...)
Show SMILES CCc1cccc(C)c1NC(=O)c1ccc(o1)-c1cc(Cl)ccc1Cl
Show InChI InChI=1S/C20H17Cl2NO2/c1-3-13-6-4-5-12(2)19(13)23-20(24)18-10-9-17(25-18)15-11-14(21)7-8-16(15)22/h4-11H,3H2,1-2H3,(H,23,24)
NCI pathway
Reactome pathway
n/an/a 41n/an/an/an/an/an/a
The Scripps Research Institute
Curated by ChEMBL
Assay Description
Antagonist activity at S1P4 receptor in human U2OS cells expressing EDG6-linked GAL4-VP16 transcription factor via TEV protease site/beta-arrestin/TE...
Bioorg Med Chem Lett 21: 3632-6 (2011)
Article DOI: 10.1016/j.bmcl.2011.04.097
BindingDB Entry DOI: 10.7270/Q2T1540Z