null
SMILES: Cc1c2CCCN3C[C@@H](F)C[C@@H]3CNc3cc(ccc3C(N)=O)-n2c2CC(C)(C)CC(=O)c12
InChI Key: InChIKey=RWRRZRNJYYDDSN-FUHWJXTLSA-N
Activity Spreadsheet -- Enzyme Inhibition Constant Data from BindingDB
Found 2 hits for monomerid = 50345159
Trg + Lig
Ki
nM
ΔG°
kcal/mole
IC50
nM
Kd
nM
EC50/IC50
nM
koff
s-1
kon
M-1s-1
pHTemp
°C
Potassium voltage-gated channel subfamily H member 2
(Homo sapiens (Human))
BDBM50345159
(CHEMBL1779539)
Show SMILES Cc1c2CCCN3C[C@@H](F)C[C@@H]3CNc3cc(ccc3C(N)=O)-n2c2CC(C)(C)CC(=O)c12 |r|
Show InChI InChI=1S/C26H33FN4O2/c1-15-21-5-4-8-30-14-16(27)9-18(30)13-29-20-10-17(6-7-19(20)25(28)33)31(21)22-11-26(2,3)12-23(32)24(15)22/h6-7,10,16,18,29H,4-5,8-9,11-14H2,1-3H3,(H2,28,33)/t16-,18+/m0/s1
Reactome pathway
n/an/a 1.64E+4n/an/an/an/an/an/a
Pfizer Inc.
Curated by ChEMBL
Assay Description
Inhibition of human ERG by HT patch clamp assay
Bioorg Med Chem Lett 21: 3627-31 (2011)
Article DOI: 10.1016/j.bmcl.2011.04.102
BindingDB Entry DOI: 10.7270/Q2VX0GVP
Heat shock protein HSP 90-alpha
(Homo sapiens (Human))
BDBM50345159
(CHEMBL1779539)
Show SMILES Cc1c2CCCN3C[C@@H](F)C[C@@H]3CNc3cc(ccc3C(N)=O)-n2c2CC(C)(C)CC(=O)c12 |r|
Show InChI InChI=1S/C26H33FN4O2/c1-15-21-5-4-8-30-14-16(27)9-18(30)13-29-20-10-17(6-7-19(20)25(28)33)31(21)22-11-26(2,3)12-23(32)24(15)22/h6-7,10,16,18,29H,4-5,8-9,11-14H2,1-3H3,(H2,28,33)/t16-,18+/m0/s1
NCI pathway
Reactome pathway
n/an/a 61n/an/an/an/an/an/a
Pfizer Inc.
Curated by ChEMBL
Assay Description
Inhibition of HSP90alpha after 3 hrs by fluorescence polarization binding assay
Bioorg Med Chem Lett 21: 3627-31 (2011)
Article DOI: 10.1016/j.bmcl.2011.04.102
BindingDB Entry DOI: 10.7270/Q2VX0GVP