BDBM50345166 CHEMBL1779546
SMILES: Cc1c2CCCN3CC[C@@H](C3)Nc3cc(ccc3C(N)=O)-n2c2CC(C)(C)CC(=O)c12
InChI Key: InChIKey=NHCNVEVTLZEMMH-INIZCTEOSA-N
Data: 1 IC50
Activity Spreadsheet -- Enzyme Inhibition Constant Data from BindingDB
Found 1 hit for monomerid = 50345166
Trg + Lig
Ki
nM
ΔG°
kcal/mole
IC50
nM
Kd
nM
EC50/IC50
nM
koff
s-1
kon
M-1s-1
pHTemp
°C
Heat shock protein HSP 90-alpha
(Homo sapiens (Human))
BDBM50345166
(CHEMBL1779546)
Show SMILES Cc1c2CCCN3CC[C@@H](C3)Nc3cc(ccc3C(N)=O)-n2c2CC(C)(C)CC(=O)c12 |r|
Show InChI InChI=1S/C25H32N4O2/c1-15-20-5-4-9-28-10-8-16(14-28)27-19-11-17(6-7-18(19)24(26)31)29(20)21-12-25(2,3)13-22(30)23(15)21/h6-7,11,16,27H,4-5,8-10,12-14H2,1-3H3,(H2,26,31)/t16-/m0/s1
NCI pathway
Reactome pathway
n/an/a 982n/an/an/an/an/an/a
Pfizer Inc.
Curated by ChEMBL
Assay Description
Inhibition of HSP90alpha after 3 hrs by fluorescence polarization binding assay
Bioorg Med Chem Lett 21: 3627-31 (2011)
Article DOI: 10.1016/j.bmcl.2011.04.102
BindingDB Entry DOI: 10.7270/Q2VX0GVP