BDBM50345445 8-oxo-8H-acenaphtho[1,2-b]pyrrole-9-carbonitrile::CHEMBL1784718
SMILES: O=c1nc2c3cccc4cccc(c2c1C#N)c34
InChI Key: InChIKey=VQYSTSIAUDPRJH-UHFFFAOYSA-N
Data: 1 IC50  1 Kd
Activity Spreadsheet -- Enzyme Inhibition Constant Data from BindingDB
Found 2 hits for monomerid = 50345445
Trg + Lig
Ki
nM
ΔG°
kcal/mole
IC50
nM
Kd
nM
EC50/IC50
nM
koff
s-1
kon
M-1s-1
pHTemp
°C
Induced myeloid leukemia cell differentiation protein Mcl-1
(Homo sapiens (Human))
BDBM50345445
(8-oxo-8H-acenaphtho[1,2-b]pyrrole-9-carbonitrile |...)
Show SMILES O=c1nc2c3cccc4cccc(c2c1C#N)c34
Show InChI InChI=1S/C15H6N2O/c16-7-11-13-9-5-1-3-8-4-2-6-10(12(8)9)14(13)17-15(11)18/h1-6H
NCI pathway
n/an/an/a 1.83E+3n/an/an/an/an/a
Dalian University of Technology
Curated by ChEMBL
Assay Description
Binding affinity to his-tagged Mcl-1 (unknown origin) expressed in Escherichia coli BL21 (DE3) cells by ITC analysis
Eur J Med Chem 59: 141-9 (2013)
Article DOI: 10.1016/j.ejmech.2012.10.050
BindingDB Entry DOI: 10.7270/Q25B03V2
Fibroblast growth factor receptor 1
(Homo sapiens (Human))
BDBM50345445
(8-oxo-8H-acenaphtho[1,2-b]pyrrole-9-carbonitrile |...)
Show SMILES O=c1nc2c3cccc4cccc(c2c1C#N)c34
Show InChI InChI=1S/C15H6N2O/c16-7-11-13-9-5-1-3-8-4-2-6-10(12(8)9)14(13)17-15(11)18/h1-6H
NCI pathway
Reactome pathway
n/an/a 4.50E+3n/an/an/an/an/an/a
East China University of Science and Technology
Curated by ChEMBL
Assay Description
Inhibition of FGFR1 using poly(Glu-Tyr)4:1 as substrate after 60 mins by ELISA
J Med Chem 54: 3732-45 (2011)
Article DOI: 10.1021/jm200258t
BindingDB Entry DOI: 10.7270/Q29W0FTH