BDBM50345447 3-(Allylthio)-8-oxo-8H-acenaphtho[1,2-b]pyrrole-9-carbonitrile::CHEMBL1784720
SMILES: C=CCSc1ccc2c3c(C#N)c(=O)nc3c3cccc1c23
InChI Key: InChIKey=FYHDZSTUIXYORQ-UHFFFAOYSA-N
Data: 1 IC50
Activity Spreadsheet -- Enzyme Inhibition Constant Data from BindingDB
Found 1 hit for monomerid = 50345447
Trg + Lig
Ki
nM
ΔG°
kcal/mole
IC50
nM
Kd
nM
EC50/IC50
nM
koff
s-1
kon
M-1s-1
pHTemp
°C
Fibroblast growth factor receptor 1
(Homo sapiens (Human))
BDBM50345447
(3-(Allylthio)-8-oxo-8H-acenaphtho[1,2-b]pyrrole-9-...)
Show SMILES C=CCSc1ccc2c3c(C#N)c(=O)nc3c3cccc1c23
Show InChI InChI=1S/C18H10N2OS/c1-2-8-22-14-7-6-11-15-10(14)4-3-5-12(15)17-16(11)13(9-19)18(21)20-17/h2-7H,1,8H2
NCI pathway
Reactome pathway
n/an/a>1.00E+4n/an/an/an/an/an/a
East China University of Science and Technology
Curated by ChEMBL
Assay Description
Inhibition of FGFR1 using poly(Glu-Tyr)4:1 as substrate after 60 mins by ELISA
J Med Chem 54: 3732-45 (2011)
Article DOI: 10.1021/jm200258t
BindingDB Entry DOI: 10.7270/Q29W0FTH