BDBM50345524 CHEMBL1784350::N-(4-((4-(2-(3,5-dimethylisoxazol-4-yl)ethyl)piperidin-1-ylsulfonyl)methyl)-2,2-dimethyltetrahydro-2H-pyran-4-yl)-N-hydroxyformamide::US10322143, Compound 14i
SMILES: Cc1noc(C)c1CCC1CCN(CC1)S(=O)(=O)CC1(CCOC(C)(C)C1)N(O)C=O
InChI Key: InChIKey=PSAIRTKPKUWNNP-UHFFFAOYSA-N
Data: 9 IC50
Activity Spreadsheet -- Enzyme Inhibition Constant Data from BindingDB
Found 9 hits for monomerid = 50345524
Trg + Lig
Ki
nM
ΔG°
kcal/mole
IC50
nM
Kd
nM
EC50/IC50
nM
koff
s-1
kon
M-1s-1
pHTemp
°C
Matrix metalloproteinase-14 (MMP14)
(Homo sapiens (Human))
BDBM50345524
(CHEMBL1784350 | N-(4-((4-(2-(3,5-dimethylisoxazol-...)
Show SMILES Cc1noc(C)c1CCC1CCN(CC1)S(=O)(=O)CC1(CCOC(C)(C)C1)N(O)C=O
Show InChI InChI=1S/C21H35N3O6S/c1-16-19(17(2)30-22-16)6-5-18-7-10-23(11-8-18)31(27,28)14-21(24(26)15-25)9-12-29-20(3,4)13-21/h15,18,26H,5-14H2,1-4H3
n/an/a>1.00E+4n/an/an/an/an/an/a
AstraZeneca
Curated by ChEMBL
Assay Description
Inhibition of recombinant human MMP-14 assessed as substrate cleavage after 20 hrs by fluorescence assay
Bioorg Med Chem Lett 21: 3301-6 (2011)
Article DOI: 10.1016/j.bmcl.2011.04.028
BindingDB Entry DOI: 10.7270/Q2P55NVH
A disintegrin and metalloproteinase with thrombospondin motifs 5 (ADAMTS-5)
(Homo sapiens (Human))
BDBM50345524
(CHEMBL1784350 | N-(4-((4-(2-(3,5-dimethylisoxazol-...)
Show SMILES Cc1noc(C)c1CCC1CCN(CC1)S(=O)(=O)CC1(CCOC(C)(C)C1)N(O)C=O
Show InChI InChI=1S/C21H35N3O6S/c1-16-19(17(2)30-22-16)6-5-18-7-10-23(11-8-18)31(27,28)14-21(24(26)15-25)9-12-29-20(3,4)13-21/h15,18,26H,5-14H2,1-4H3
Reactome pathway
n/an/a 250n/an/an/an/an/an/a
AstraZeneca
Curated by ChEMBL
Assay Description
Inhibition of ADAMTS-5 assessed as substrate cleavage after 16 hrs by fluorescence assay
Bioorg Med Chem Lett 21: 3301-6 (2011)
Article DOI: 10.1016/j.bmcl.2011.04.028
BindingDB Entry DOI: 10.7270/Q2P55NVH
A disintegrin and metalloproteinase with thrombospondin motifs 4 (ADAMTS-4)
(Homo sapiens (Human))
BDBM50345524
(CHEMBL1784350 | N-(4-((4-(2-(3,5-dimethylisoxazol-...)
Show SMILES Cc1noc(C)c1CCC1CCN(CC1)S(=O)(=O)CC1(CCOC(C)(C)C1)N(O)C=O
Show InChI InChI=1S/C21H35N3O6S/c1-16-19(17(2)30-22-16)6-5-18-7-10-23(11-8-18)31(27,28)14-21(24(26)15-25)9-12-29-20(3,4)13-21/h15,18,26H,5-14H2,1-4H3
Reactome pathway
n/an/a 9.70n/an/an/an/an/an/a
AstraZeneca
Curated by ChEMBL
Assay Description
Inhibition of ADAMTS-4 assessed as substrate cleavage after 16 hrs by fluorescence assay
Bioorg Med Chem Lett 21: 3301-6 (2011)
Article DOI: 10.1016/j.bmcl.2011.04.028
BindingDB Entry DOI: 10.7270/Q2P55NVH
Matrix metalloproteinase-9
(Homo sapiens (Human))
BDBM50345524
(CHEMBL1784350 | N-(4-((4-(2-(3,5-dimethylisoxazol-...)
Show SMILES Cc1noc(C)c1CCC1CCN(CC1)S(=O)(=O)CC1(CCOC(C)(C)C1)N(O)C=O
Show InChI InChI=1S/C21H35N3O6S/c1-16-19(17(2)30-22-16)6-5-18-7-10-23(11-8-18)31(27,28)14-21(24(26)15-25)9-12-29-20(3,4)13-21/h15,18,26H,5-14H2,1-4H3
Reactome pathway
n/an/a>1.00E+4n/an/an/an/an/an/a
AstraZeneca
Curated by ChEMBL
Assay Description
Inhibition of recombinant human MMP-9 assessed as substrate cleavage after 20 hrs by fluorescence assay
Bioorg Med Chem Lett 21: 3301-6 (2011)
Article DOI: 10.1016/j.bmcl.2011.04.028
BindingDB Entry DOI: 10.7270/Q2P55NVH
A disintegrin and metalloproteinase with thrombospondin motifs 4 (ADAMTS-4)
(Homo sapiens (Human))
BDBM50345524
(CHEMBL1784350 | N-(4-((4-(2-(3,5-dimethylisoxazol-...)
Show SMILES Cc1noc(C)c1CCC1CCN(CC1)S(=O)(=O)CC1(CCOC(C)(C)C1)N(O)C=O
Show InChI InChI=1S/C21H35N3O6S/c1-16-19(17(2)30-22-16)6-5-18-7-10-23(11-8-18)31(27,28)14-21(24(26)15-25)9-12-29-20(3,4)13-21/h15,18,26H,5-14H2,1-4H3
Reactome pathway
US Patent
n/an/a 9.70n/an/an/an/an/an/a
AstraZeneca
Assay Description
Protein concentrations were measured using the Micro BCA Protein Assay Kit (Pierce/Thermo Scientific, IL). Sample buffer was mixed with 5-25 μg ...
Bioorg Med Chem Lett 19: 4280-3 (2009)
BindingDB Entry DOI: 10.7270/Q2BC41VN
Cytochrome P450 3A4
(Homo sapiens (Human))
BDBM50345524
(CHEMBL1784350 | N-(4-((4-(2-(3,5-dimethylisoxazol-...)
Show SMILES Cc1noc(C)c1CCC1CCN(CC1)S(=O)(=O)CC1(CCOC(C)(C)C1)N(O)C=O
Show InChI InChI=1S/C21H35N3O6S/c1-16-19(17(2)30-22-16)6-5-18-7-10-23(11-8-18)31(27,28)14-21(24(26)15-25)9-12-29-20(3,4)13-21/h15,18,26H,5-14H2,1-4H3
Reactome pathway
n/an/a>1.00E+4n/an/an/an/an/an/a
AstraZeneca
Curated by ChEMBL
Assay Description
Inhibition of CYP3A4
Bioorg Med Chem Lett 21: 3301-6 (2011)
Article DOI: 10.1016/j.bmcl.2011.04.028
BindingDB Entry DOI: 10.7270/Q2P55NVH
72 kDa type IV collagenase
(Homo sapiens (Human))
BDBM50345524
(CHEMBL1784350 | N-(4-((4-(2-(3,5-dimethylisoxazol-...)
Show SMILES Cc1noc(C)c1CCC1CCN(CC1)S(=O)(=O)CC1(CCOC(C)(C)C1)N(O)C=O
Show InChI InChI=1S/C21H35N3O6S/c1-16-19(17(2)30-22-16)6-5-18-7-10-23(11-8-18)31(27,28)14-21(24(26)15-25)9-12-29-20(3,4)13-21/h15,18,26H,5-14H2,1-4H3
Reactome pathway
n/an/a>1.00E+4n/an/an/an/an/an/a
AstraZeneca
Curated by ChEMBL
Assay Description
Inhibition of recombinant human MMP-2 assessed as substrate cleavage after 20 hrs by fluorescence assay
Bioorg Med Chem Lett 21: 3301-6 (2011)
Article DOI: 10.1016/j.bmcl.2011.04.028
BindingDB Entry DOI: 10.7270/Q2P55NVH
Collagenase 3
(Homo sapiens (Human))
BDBM50345524
(CHEMBL1784350 | N-(4-((4-(2-(3,5-dimethylisoxazol-...)
Show SMILES Cc1noc(C)c1CCC1CCN(CC1)S(=O)(=O)CC1(CCOC(C)(C)C1)N(O)C=O
Show InChI InChI=1S/C21H35N3O6S/c1-16-19(17(2)30-22-16)6-5-18-7-10-23(11-8-18)31(27,28)14-21(24(26)15-25)9-12-29-20(3,4)13-21/h15,18,26H,5-14H2,1-4H3
NCI pathway
Reactome pathway
n/an/a>1.00E+4n/an/an/an/an/an/a
AstraZeneca
Curated by ChEMBL
Assay Description
Inhibition of recombinant human MMP-13 assessed as substrate cleavage after 20 hrs by fluorescence assay
Bioorg Med Chem Lett 21: 3301-6 (2011)
Article DOI: 10.1016/j.bmcl.2011.04.028
BindingDB Entry DOI: 10.7270/Q2P55NVH
Interstitial collagenase
(Homo sapiens (Human))
BDBM50345524
(CHEMBL1784350 | N-(4-((4-(2-(3,5-dimethylisoxazol-...)
Show SMILES Cc1noc(C)c1CCC1CCN(CC1)S(=O)(=O)CC1(CCOC(C)(C)C1)N(O)C=O
Show InChI InChI=1S/C21H35N3O6S/c1-16-19(17(2)30-22-16)6-5-18-7-10-23(11-8-18)31(27,28)14-21(24(26)15-25)9-12-29-20(3,4)13-21/h15,18,26H,5-14H2,1-4H3
Reactome pathway
n/an/a>1.00E+4n/an/an/an/an/an/a
AstraZeneca
Curated by ChEMBL
Assay Description
Inhibition of recombinant human MMP-1 assessed as substrate cleavage after 20 hrs by fluorescence assay
Bioorg Med Chem Lett 21: 3301-6 (2011)
Article DOI: 10.1016/j.bmcl.2011.04.028
BindingDB Entry DOI: 10.7270/Q2P55NVH