BDBM50345713 3-(naphthalen-1-ylmethyl)-1-(2-(piperidin-4-yl)ethyl)-1H-pyrazolo[3,4-d]pyrimidin-4-amine::CHEMBL1784965::US10544104, Compound 5i::US9765037, Compound 5i
SMILES: Nc1ncnc2n(CCC3CCNCC3)nc(Cc3cccc4ccccc34)c12
InChI Key: InChIKey=XLHSLEFSSSWIGF-UHFFFAOYSA-N
Data: 7 IC50
Activity Spreadsheet -- Enzyme Inhibition Constant Data from BindingDB
Found 7 hits for monomerid = 50345713
Trg + Lig
Ki
nM
ΔG°
kcal/mole
IC50
nM
Kd
nM
EC50/IC50
nM
koff
s-1
kon
M-1s-1
pHTemp
°C
Calmodulin-domain protein kinase 1 (CDPK1)
(Toxoplasma gondii)
BDBM50345713
(3-(naphthalen-1-ylmethyl)-1-(2-(piperidin-4-yl)eth...)
Show SMILES Nc1ncnc2n(CCC3CCNCC3)nc(Cc3cccc4ccccc34)c12
Show InChI InChI=1S/C23H26N6/c24-22-21-20(14-18-6-3-5-17-4-1-2-7-19(17)18)28-29(23(21)27-15-26-22)13-10-16-8-11-25-12-9-16/h1-7,15-16,25H,8-14H2,(H2,24,26,27)
n/an/a 52n/an/an/an/an/an/a
University of Washington.
Curated by ChEMBL
Assay Description
Inhibition of Toxoplasma gondii recombinant N-terminal hexahistidine tagged CDPK1 expressed in Escherichia coli using syntide-2 as substrate after 90...
ACS Med Chem Lett 1: 331-335 (2011)
Article DOI: 10.1021/ml100096t
BindingDB Entry DOI: 10.7270/Q2JW8FV5
Calmodulin-domain protein kinase 1 (CDPK1)
(Toxoplasma gondii)
BDBM50345713
(3-(naphthalen-1-ylmethyl)-1-(2-(piperidin-4-yl)eth...)
Show SMILES Nc1ncnc2n(CCC3CCNCC3)nc(Cc3cccc4ccccc34)c12
Show InChI InChI=1S/C23H26N6/c24-22-21-20(14-18-6-3-5-17-4-1-2-7-19(17)18)28-29(23(21)27-15-26-22)13-10-16-8-11-25-12-9-16/h1-7,15-16,25H,8-14H2,(H2,24,26,27)
US Patent
n/an/a 52n/an/an/an/an/an/a
University of Washington Through its Center for Commercialization
US Patent
Assay Description
Most known kinase inhibitors bind in the ATP-binding pocket of the active site19,20. These inhibitors exploit many of the same hydrophobic contacts a...
US Patent US9765037 (2017)
BindingDB Entry DOI: 10.7270/Q2B56MVC
Calcium-dependent protein kinase 1 (CDPK1)
(Cryptosporidium parvum)
BDBM50345713
(3-(naphthalen-1-ylmethyl)-1-(2-(piperidin-4-yl)eth...)
Show SMILES Nc1ncnc2n(CCC3CCNCC3)nc(Cc3cccc4ccccc34)c12
Show InChI InChI=1S/C23H26N6/c24-22-21-20(14-18-6-3-5-17-4-1-2-7-19(17)18)28-29(23(21)27-15-26-22)13-10-16-8-11-25-12-9-16/h1-7,15-16,25H,8-14H2,(H2,24,26,27)
US Patent
n/an/a 34n/an/an/an/an/an/a
University of Washington Through its Center for Commercialization
US Patent
Assay Description
Two types of enzyme assays were developed to follow TgCDPK1 activity, a radiometric scintillation proximity assay measured the labeled γ-phospha...
US Patent US9765037 (2017)
BindingDB Entry DOI: 10.7270/Q2B56MVC
Calmodulin-domain protein kinase 1, putative
(Cryptosporidium parvum (strain Iowa II))
BDBM50345713
(3-(naphthalen-1-ylmethyl)-1-(2-(piperidin-4-yl)eth...)
Show SMILES Nc1ncnc2n(CCC3CCNCC3)nc(Cc3cccc4ccccc34)c12
Show InChI InChI=1S/C23H26N6/c24-22-21-20(14-18-6-3-5-17-4-1-2-7-19(17)18)28-29(23(21)27-15-26-22)13-10-16-8-11-25-12-9-16/h1-7,15-16,25H,8-14H2,(H2,24,26,27)
US Patent
n/an/a 34n/an/an/an/an/an/a
UNIVERSITY OF WASHINGTON THROUGH ITS CENTER FOR CO
US Patent
Assay Description
Inhibition of TgCDPK1 and CpCDPK1 was determined using a luminescent kinase assay which measures ATP depletion in the presence of the Syntide 2 pepti...
US Patent US10544104 (2020)
BindingDB Entry DOI: 10.7270/Q2D79DSF
Calmodulin-domain protein kinase 1
(Toxoplasma gondii)
BDBM50345713
(3-(naphthalen-1-ylmethyl)-1-(2-(piperidin-4-yl)eth...)
Show SMILES Nc1ncnc2n(CCC3CCNCC3)nc(Cc3cccc4ccccc34)c12
Show InChI InChI=1S/C23H26N6/c24-22-21-20(14-18-6-3-5-17-4-1-2-7-19(17)18)28-29(23(21)27-15-26-22)13-10-16-8-11-25-12-9-16/h1-7,15-16,25H,8-14H2,(H2,24,26,27)
US Patent
n/an/a 52n/an/an/an/an/an/a
UNIVERSITY OF WASHINGTON THROUGH ITS CENTER FOR CO
US Patent
Assay Description
Inhibition of TgCDPK1 and CpCDPK1 was determined using a luminescent kinase assay which measures ATP depletion in the presence of the Syntide 2 pepti...
US Patent US10544104 (2020)
BindingDB Entry DOI: 10.7270/Q2D79DSF
Calmodulin-domain protein kinase 1
(Toxoplasma gondii)
BDBM50345713
(3-(naphthalen-1-ylmethyl)-1-(2-(piperidin-4-yl)eth...)
Show SMILES Nc1ncnc2n(CCC3CCNCC3)nc(Cc3cccc4ccccc34)c12
Show InChI InChI=1S/C23H26N6/c24-22-21-20(14-18-6-3-5-17-4-1-2-7-19(17)18)28-29(23(21)27-15-26-22)13-10-16-8-11-25-12-9-16/h1-7,15-16,25H,8-14H2,(H2,24,26,27)
US Patent
n/an/a 52n/an/an/an/an/an/a
UNIVERSITY OF WASHINGTON THROUGH ITS CENTER FOR CO
US Patent
Assay Description
Inhibition of TgCDPK1 and CpCDPK1 was determined using a luminescent kinase assay which measures ATP depletion in the presence of the Syntide 2 pepti...
US Patent US10544104 (2020)
BindingDB Entry DOI: 10.7270/Q2D79DSF
Calmodulin-domain protein kinase 1, putative
(Cryptosporidium parvum (strain Iowa II))
BDBM50345713
(3-(naphthalen-1-ylmethyl)-1-(2-(piperidin-4-yl)eth...)
Show SMILES Nc1ncnc2n(CCC3CCNCC3)nc(Cc3cccc4ccccc34)c12
Show InChI InChI=1S/C23H26N6/c24-22-21-20(14-18-6-3-5-17-4-1-2-7-19(17)18)28-29(23(21)27-15-26-22)13-10-16-8-11-25-12-9-16/h1-7,15-16,25H,8-14H2,(H2,24,26,27)
US Patent
n/an/a 34n/an/an/an/an/an/a
UNIVERSITY OF WASHINGTON THROUGH ITS CENTER FOR CO
US Patent
Assay Description
Inhibition of TgCDPK1 and CpCDPK1 was determined using a luminescent kinase assay which measures ATP depletion in the presence of the Syntide 2 pepti...
US Patent US10544104 (2020)
BindingDB Entry DOI: 10.7270/Q2D79DSF