BDBM50345911 CHEMBL1783852::CHEMBL1789669::N-(diaminomethylene)-3-nitro-4-((4-(2,3,4-trimethoxybenzyl)piperazin-1-yl)methyl)benzamide hydrochloride
SMILES: COc1ccc(CN2CCN(Cc3ccc(cc3[N+]([O-])=O)C(=O)NC(N)=N)CC2)c(OC)c1OC
InChI Key: InChIKey=RYJLAOOTBSUKSD-UHFFFAOYSA-N
Data: 2 IC50
Activity Spreadsheet -- Enzyme Inhibition Constant Data from BindingDB
Found 2 hits for monomerid = 50345911
Trg + Lig
Ki
nM
ΔG°
kcal/mole
IC50
nM
Kd
nM
EC50/IC50
nM
koff
s-1
kon
M-1s-1
pHTemp
°C
Sodium/hydrogen exchanger 1
(Rattus norvegicus)
BDBM50345911
(CHEMBL1783852 | CHEMBL1789669 | N-(diaminomethylen...)
Show SMILES COc1ccc(CN2CCN(Cc3ccc(cc3[N+]([O-])=O)C(=O)NC(N)=N)CC2)c(OC)c1OC
Show InChI InChI=1S/C23H30N6O6/c1-33-19-7-6-17(20(34-2)21(19)35-3)14-28-10-8-27(9-11-28)13-16-5-4-15(12-18(16)29(31)32)22(30)26-23(24)25/h4-7,12H,8-11,13-14H2,1-3H3,(H4,24,25,26,30)
Reactome pathway
n/an/a 1.82n/an/an/an/an/an/a
China Pharmaceutical University
Curated by ChEMBL
Assay Description
Inhibition of NHE1 in Sprague-Dawley rat assessed as inhibition of acid-induced platelet swelling by spectrophotometric analysis
Eur J Med Chem 46: 4107-16 (2011)
Article DOI: 10.1016/j.ejmech.2011.06.011
BindingDB Entry DOI: 10.7270/Q27081T0
Sodium/hydrogen exchanger 1
(Rattus norvegicus)
BDBM50345911
(CHEMBL1783852 | CHEMBL1789669 | N-(diaminomethylen...)
Show SMILES COc1ccc(CN2CCN(Cc3ccc(cc3[N+]([O-])=O)C(=O)NC(N)=N)CC2)c(OC)c1OC
Show InChI InChI=1S/C23H30N6O6/c1-33-19-7-6-17(20(34-2)21(19)35-3)14-28-10-8-27(9-11-28)13-16-5-4-15(12-18(16)29(31)32)22(30)26-23(24)25/h4-7,12H,8-11,13-14H2,1-3H3,(H4,24,25,26,30)
Reactome pathway
n/an/a 3.60n/an/an/an/an/an/a
China Pharmaceutical University
Curated by ChEMBL
Assay Description
Inhibition of NHE1-mediated rat platelet swelling
Bioorg Med Chem Lett 19: 3283-7 (2009)
Article DOI: 10.1016/j.bmcl.2009.04.079
BindingDB Entry DOI: 10.7270/Q2BR8SJ1