BDBM50345926 3-Benzo[1,3]dioxol-5-yl-9-prop-2-ynylamino-3H-thieno[2,3-d:4,5-d']dipyrimidin-4-one::CHEMBL1784074
SMILES: O=c1n(cnc2c1sc1ncnc(NCC#C)c21)-c1ccc2OCOc2c1
InChI Key: InChIKey=ZWGHMVXHXRTKNE-UHFFFAOYSA-N
Data: 1 KI  2 IC50
Activity Spreadsheet -- Enzyme Inhibition Constant Data from BindingDB
Found 3 hits for monomerid = 50345926
Trg + Lig
Ki
nM
ΔG°
kcal/mole
IC50
nM
Kd
nM
EC50/IC50
nM
koff
s-1
kon
M-1s-1
pHTemp
°C
Metabotropic glutamate receptor
(RAT)
BDBM50345926
(3-Benzo[1,3]dioxol-5-yl-9-prop-2-ynylamino-3H-thie...)
Show SMILES O=c1n(cnc2c1sc1ncnc(NCC#C)c21)-c1ccc2OCOc2c1
Show InChI InChI=1S/C18H11N5O3S/c1-2-5-19-16-13-14-15(27-17(13)21-7-20-16)18(24)23(8-22-14)10-3-4-11-12(6-10)26-9-25-11/h1,3-4,6-8H,5,9H2,(H,19,20,21)
997n/an/an/an/an/an/an/an/a
Schering-Plough Research Institute
Curated by ChEMBL
Assay Description
Antagonist activity at rat mGluR1
Bioorg Med Chem Lett 19: 3199-203 (2009)
Article DOI: 10.1016/j.bmcl.2009.04.104
BindingDB Entry DOI: 10.7270/Q27081SJ
Metabotropic glutamate receptor 1
(Homo sapiens (Human))
BDBM50345926
(3-Benzo[1,3]dioxol-5-yl-9-prop-2-ynylamino-3H-thie...)
Show SMILES O=c1n(cnc2c1sc1ncnc(NCC#C)c21)-c1ccc2OCOc2c1
Show InChI InChI=1S/C18H11N5O3S/c1-2-5-19-16-13-14-15(27-17(13)21-7-20-16)18(24)23(8-22-14)10-3-4-11-12(6-10)26-9-25-11/h1,3-4,6-8H,5,9H2,(H,19,20,21)
n/an/a 137n/an/an/an/an/an/a
Schering-Plough Research Institute
Curated by ChEMBL
Assay Description
Antagonist activity at human mGluR1
Bioorg Med Chem Lett 19: 3199-203 (2009)
Article DOI: 10.1016/j.bmcl.2009.04.104
BindingDB Entry DOI: 10.7270/Q27081SJ
Metabotropic glutamate receptor 5
(Homo sapiens (Human))
BDBM50345926
(3-Benzo[1,3]dioxol-5-yl-9-prop-2-ynylamino-3H-thie...)
Show SMILES O=c1n(cnc2c1sc1ncnc(NCC#C)c21)-c1ccc2OCOc2c1
Show InChI InChI=1S/C18H11N5O3S/c1-2-5-19-16-13-14-15(27-17(13)21-7-20-16)18(24)23(8-22-14)10-3-4-11-12(6-10)26-9-25-11/h1,3-4,6-8H,5,9H2,(H,19,20,21)
n/an/a>3.00E+3n/an/an/an/an/an/a
Schering-Plough Research Institute
Curated by ChEMBL
Assay Description
Antagonist activity at human mGluR5
Bioorg Med Chem Lett 19: 3199-203 (2009)
Article DOI: 10.1016/j.bmcl.2009.04.104
BindingDB Entry DOI: 10.7270/Q27081SJ