BDBM50345929 3-Benzofuran-5-yl-9-prop-2-ynylamino-3H-thieno[2,3-d:4,5-d']dipyrimidin-4-one::CHEMBL1784077
SMILES: O=c1n(cnc2c1sc1ncnc(NCC#C)c21)-c1ccc2occc2c1
InChI Key: InChIKey=PIFCEBFHXHBONI-UHFFFAOYSA-N
Data: 1 KI  2 IC50
Activity Spreadsheet -- Enzyme Inhibition Constant Data from BindingDB
Found 3 hits for monomerid = 50345929
Trg + Lig
Ki
nM
ΔG°
kcal/mole
IC50
nM
Kd
nM
EC50/IC50
nM
koff
s-1
kon
M-1s-1
pHTemp
°C
Metabotropic glutamate receptor
(RAT)
BDBM50345929
(3-Benzofuran-5-yl-9-prop-2-ynylamino-3H-thieno[2,3...)
Show SMILES O=c1n(cnc2c1sc1ncnc(NCC#C)c21)-c1ccc2occc2c1
Show InChI InChI=1S/C19H11N5O2S/c1-2-6-20-17-14-15-16(27-18(14)22-9-21-17)19(25)24(10-23-15)12-3-4-13-11(8-12)5-7-26-13/h1,3-5,7-10H,6H2,(H,20,21,22)
63n/an/an/an/an/an/an/an/a
Schering-Plough Research Institute
Curated by ChEMBL
Assay Description
Antagonist activity at rat mGluR1
Bioorg Med Chem Lett 19: 3199-203 (2009)
Article DOI: 10.1016/j.bmcl.2009.04.104
BindingDB Entry DOI: 10.7270/Q27081SJ
Metabotropic glutamate receptor 1
(Homo sapiens (Human))
BDBM50345929
(3-Benzofuran-5-yl-9-prop-2-ynylamino-3H-thieno[2,3...)
Show SMILES O=c1n(cnc2c1sc1ncnc(NCC#C)c21)-c1ccc2occc2c1
Show InChI InChI=1S/C19H11N5O2S/c1-2-6-20-17-14-15-16(27-18(14)22-9-21-17)19(25)24(10-23-15)12-3-4-13-11(8-12)5-7-26-13/h1,3-5,7-10H,6H2,(H,20,21,22)
n/an/a 21n/an/an/an/an/an/a
Schering-Plough Research Institute
Curated by ChEMBL
Assay Description
Antagonist activity at human mGluR1
Bioorg Med Chem Lett 19: 3199-203 (2009)
Article DOI: 10.1016/j.bmcl.2009.04.104
BindingDB Entry DOI: 10.7270/Q27081SJ
Metabotropic glutamate receptor 5
(Homo sapiens (Human))
BDBM50345929
(3-Benzofuran-5-yl-9-prop-2-ynylamino-3H-thieno[2,3...)
Show SMILES O=c1n(cnc2c1sc1ncnc(NCC#C)c21)-c1ccc2occc2c1
Show InChI InChI=1S/C19H11N5O2S/c1-2-6-20-17-14-15-16(27-18(14)22-9-21-17)19(25)24(10-23-15)12-3-4-13-11(8-12)5-7-26-13/h1,3-5,7-10H,6H2,(H,20,21,22)
n/an/a>3.00E+3n/an/an/an/an/an/a
Schering-Plough Research Institute
Curated by ChEMBL
Assay Description
Antagonist activity at human mGluR5
Bioorg Med Chem Lett 19: 3199-203 (2009)
Article DOI: 10.1016/j.bmcl.2009.04.104
BindingDB Entry DOI: 10.7270/Q27081SJ