BDBM50345943 3-(4-Bromo-phenyl)-9-(2-methyl-allylamino)-3H-pyrido[3',2':4,5]thieno[3,2-d]pyrimidin-4-one::CHEMBL1783870
SMILES: CC(=C)CNc1ccnc2sc3c(ncn(-c4ccc(Br)cc4)c3=O)c12
InChI Key: InChIKey=VSZGTFORDITXDC-UHFFFAOYSA-N
Data: 1 KI  2 IC50
Activity Spreadsheet -- Enzyme Inhibition Constant Data from BindingDB
Found 3 hits for monomerid = 50345943
Trg + Lig
Ki
nM
ΔG°
kcal/mole
IC50
nM
Kd
nM
EC50/IC50
nM
koff
s-1
kon
M-1s-1
pHTemp
°C
Metabotropic glutamate receptor
(RAT)
BDBM50345943
(3-(4-Bromo-phenyl)-9-(2-methyl-allylamino)-3H-pyri...)
Show SMILES CC(=C)CNc1ccnc2sc3c(ncn(-c4ccc(Br)cc4)c3=O)c12
Show InChI InChI=1S/C19H15BrN4OS/c1-11(2)9-22-14-7-8-21-18-15(14)16-17(26-18)19(25)24(10-23-16)13-5-3-12(20)4-6-13/h3-8,10H,1,9H2,2H3,(H,21,22)
1.5n/an/an/an/an/an/an/an/a
Schering-Plough Research Institute
Curated by ChEMBL
Assay Description
Antagonist activity at rat mGluR1
Bioorg Med Chem Lett 19: 3199-203 (2009)
Article DOI: 10.1016/j.bmcl.2009.04.104
BindingDB Entry DOI: 10.7270/Q27081SJ
Metabotropic glutamate receptor 1
(Homo sapiens (Human))
BDBM50345943
(3-(4-Bromo-phenyl)-9-(2-methyl-allylamino)-3H-pyri...)
Show SMILES CC(=C)CNc1ccnc2sc3c(ncn(-c4ccc(Br)cc4)c3=O)c12
Show InChI InChI=1S/C19H15BrN4OS/c1-11(2)9-22-14-7-8-21-18-15(14)16-17(26-18)19(25)24(10-23-16)13-5-3-12(20)4-6-13/h3-8,10H,1,9H2,2H3,(H,21,22)
n/an/a 43n/an/an/an/an/an/a
Schering-Plough Research Institute
Curated by ChEMBL
Assay Description
Antagonist activity at human mGluR1
Bioorg Med Chem Lett 19: 3199-203 (2009)
Article DOI: 10.1016/j.bmcl.2009.04.104
BindingDB Entry DOI: 10.7270/Q27081SJ
Metabotropic glutamate receptor 5
(Homo sapiens (Human))
BDBM50345943
(3-(4-Bromo-phenyl)-9-(2-methyl-allylamino)-3H-pyri...)
Show SMILES CC(=C)CNc1ccnc2sc3c(ncn(-c4ccc(Br)cc4)c3=O)c12
Show InChI InChI=1S/C19H15BrN4OS/c1-11(2)9-22-14-7-8-21-18-15(14)16-17(26-18)19(25)24(10-23-16)13-5-3-12(20)4-6-13/h3-8,10H,1,9H2,2H3,(H,21,22)
n/an/a>3.00E+3n/an/an/an/an/an/a
Schering-Plough Research Institute
Curated by ChEMBL
Assay Description
Antagonist activity at human mGluR5
Bioorg Med Chem Lett 19: 3199-203 (2009)
Article DOI: 10.1016/j.bmcl.2009.04.104
BindingDB Entry DOI: 10.7270/Q27081SJ