null
SMILES: CC(=C)CNc1ncnc2sc3c(ncn(-c4ccc5ncsc5c4)c3=O)c12
InChI Key: InChIKey=YQOGQABYYVWKJN-UHFFFAOYSA-N
Activity Spreadsheet -- Enzyme Inhibition Constant Data from BindingDB
Found 3 hits for monomerid = 50345965
Trg + Lig
Ki
nM
ΔG°
kcal/mole
IC50
nM
Kd
nM
EC50/IC50
nM
koff
s-1
kon
M-1s-1
pHTemp
°C
Metabotropic glutamate receptor 1
(RAT)
BDBM50345965
(3-Benzothiazol-6-yl-9-(2-methyl-allylamino)-3H-thi...)
Show SMILES CC(=C)CNc1ncnc2sc3c(ncn(-c4ccc5ncsc5c4)c3=O)c12
Show InChI InChI=1S/C19H14N6OS2/c1-10(2)6-20-17-14-15-16(28-18(14)22-7-21-17)19(26)25(8-23-15)11-3-4-12-13(5-11)27-9-24-12/h3-5,7-9H,1,6H2,2H3,(H,20,21,22)
49n/an/an/an/an/an/an/an/a
Schering-Plough Research Institute
Curated by ChEMBL
Assay Description
Antagonist activity at rat mGluR1
Bioorg Med Chem Lett 19: 3199-203 (2009)
Article DOI: 10.1016/j.bmcl.2009.04.104
BindingDB Entry DOI: 10.7270/Q27081SJ
Metabotropic glutamate receptor 1
(Homo sapiens (Human))
BDBM50345965
(3-Benzothiazol-6-yl-9-(2-methyl-allylamino)-3H-thi...)
Show SMILES CC(=C)CNc1ncnc2sc3c(ncn(-c4ccc5ncsc5c4)c3=O)c12
Show InChI InChI=1S/C19H14N6OS2/c1-10(2)6-20-17-14-15-16(28-18(14)22-7-21-17)19(26)25(8-23-15)11-3-4-12-13(5-11)27-9-24-12/h3-5,7-9H,1,6H2,2H3,(H,20,21,22)
n/an/a 17n/an/an/an/an/an/a
Schering-Plough Research Institute
Curated by ChEMBL
Assay Description
Antagonist activity at human mGluR1
Bioorg Med Chem Lett 19: 3199-203 (2009)
Article DOI: 10.1016/j.bmcl.2009.04.104
BindingDB Entry DOI: 10.7270/Q27081SJ
Metabotropic glutamate receptor 5
(Homo sapiens (Human))
BDBM50345965
(3-Benzothiazol-6-yl-9-(2-methyl-allylamino)-3H-thi...)
Show SMILES CC(=C)CNc1ncnc2sc3c(ncn(-c4ccc5ncsc5c4)c3=O)c12
Show InChI InChI=1S/C19H14N6OS2/c1-10(2)6-20-17-14-15-16(28-18(14)22-7-21-17)19(26)25(8-23-15)11-3-4-12-13(5-11)27-9-24-12/h3-5,7-9H,1,6H2,2H3,(H,20,21,22)
n/an/a>3.00E+3n/an/an/an/an/an/a
Schering-Plough Research Institute
Curated by ChEMBL
Assay Description
Antagonist activity at human mGluR5
Bioorg Med Chem Lett 19: 3199-203 (2009)
Article DOI: 10.1016/j.bmcl.2009.04.104
BindingDB Entry DOI: 10.7270/Q27081SJ