null
SMILES: Cc1ccc(CC(C)(C)NC[C@@H](O)COc2cc(ccc2C#N)C2CC3CC2C2C3C2C(O)=O)cc1F
InChI Key: InChIKey=WGGASNOPFWFLQW-IYBOAGAWSA-N
Activity Spreadsheet -- Enzyme Inhibition Constant Data from BindingDB
Found 1 hit for monomerid = 50346033
Trg + Lig
Ki
nM
ΔG°
kcal/mole
IC50
nM
Kd
nM
EC50/IC50
nM
koff
s-1
kon
M-1s-1
pHTemp
°C
Extracellular calcium-sensing receptor
(Homo sapiens (Human))
BDBM50346033
(6-(4-Cyano-3-{(R)-3-[2-(3-fluoro-4-methyl-phenyl)-...)
Show SMILES Cc1ccc(CC(C)(C)NC[C@@H](O)COc2cc(ccc2C#N)C2CC3CC2C2C3C2C(O)=O)cc1F |r|
Show InChI InChI=1S/C30H35FN2O4/c1-16-4-5-17(8-24(16)31)12-30(2,3)33-14-21(34)15-37-25-11-18(6-7-19(25)13-32)22-9-20-10-23(22)27-26(20)28(27)29(35)36/h4-8,11,20-23,26-28,33-34H,9-10,12,14-15H2,1-3H3,(H,35,36)/t20?,21-,22?,23?,26?,27?,28?/m1/s1
n/an/a 23n/an/an/an/an/an/a
Pfizer Inc.
Curated by ChEMBL
Assay Description
Negative allosteric modulator activity at human recombinant calcium sensing receptor expressed in HEK cells
Bioorg Med Chem Lett 19: 3328-32 (2009)
Article DOI: 10.1016/j.bmcl.2009.04.044
BindingDB Entry DOI: 10.7270/Q2K937V7