null
SMILES: Cc1cccc(c1)-c1nc(C)c(CC=C)c(Nc2ccc(CC(O)=O)cc2)n1
InChI Key: InChIKey=WUMLYRUOCJWVIM-UHFFFAOYSA-N
Activity Spreadsheet -- Enzyme Inhibition Constant Data from BindingDB
Found 2 hits for monomerid = 50346115
Trg + Lig
Ki
nM
ΔG°
kcal/mole
IC50
nM
Kd
nM
EC50/IC50
nM
koff
s-1
kon
M-1s-1
pHTemp
°C
cAMP-specific 3',5'-cyclic phosphodiesterase 4D
(Homo sapiens (Human))
BDBM50346115
(2-(4-(5-allyl-6-methyl-2-m-tolylpyrimidin-4-ylamin...)
Show SMILES Cc1cccc(c1)-c1nc(C)c(CC=C)c(Nc2ccc(CC(O)=O)cc2)n1
Show InChI InChI=1S/C23H23N3O2/c1-4-6-20-16(3)24-22(18-8-5-7-15(2)13-18)26-23(20)25-19-11-9-17(10-12-19)14-21(27)28/h4-5,7-13H,1,6,14H2,2-3H3,(H,27,28)(H,24,25,26)
n/an/a 9.90E+3n/an/an/an/an/an/a
Asahi Kasei Pharma Corporation
Curated by ChEMBL
Assay Description
Inhibition of human PDE4D3 incubated for 10 mins using cAMP and [3H]cAMP substrates
Bioorg Med Chem Lett 19: 3174-6 (2009)
Article DOI: 10.1016/j.bmcl.2009.04.121
BindingDB Entry DOI: 10.7270/Q26110NQ
cAMP-specific 3',5'-cyclic phosphodiesterase 4B
(Homo sapiens (Human))
BDBM50346115
(2-(4-(5-allyl-6-methyl-2-m-tolylpyrimidin-4-ylamin...)
Show SMILES Cc1cccc(c1)-c1nc(C)c(CC=C)c(Nc2ccc(CC(O)=O)cc2)n1
Show InChI InChI=1S/C23H23N3O2/c1-4-6-20-16(3)24-22(18-8-5-7-15(2)13-18)26-23(20)25-19-11-9-17(10-12-19)14-21(27)28/h4-5,7-13H,1,6,14H2,2-3H3,(H,27,28)(H,24,25,26)
n/an/a 1.20E+3n/an/an/an/an/an/a
Asahi Kasei Pharma Corporation
Curated by ChEMBL
Assay Description
Inhibition of human PDE4B1 incubated for 10 mins using cAMP and [3H]cAMP substrates
Bioorg Med Chem Lett 19: 3174-6 (2009)
Article DOI: 10.1016/j.bmcl.2009.04.121
BindingDB Entry DOI: 10.7270/Q26110NQ