null
SMILES: CCc1c(C)nc(nc1Nc1ccc(CC(O)=O)cc1)-c1ccc(SC)s1
InChI Key: InChIKey=YLAIOOHSDYVNRC-UHFFFAOYSA-N
Activity Spreadsheet -- Enzyme Inhibition Constant Data from BindingDB
Found 2 hits for monomerid = 50346119
Trg + Lig
Ki
nM
ΔG°
kcal/mole
IC50
nM
Kd
nM
EC50/IC50
nM
koff
s-1
kon
M-1s-1
pHTemp
°C
cAMP-specific 3',5'-cyclic phosphodiesterase 4D
(Homo sapiens (Human))
BDBM50346119
(2-(4-(5-ethyl-6-methyl-2-(5-(methylthio)thiophen-2...)
Show SMILES CCc1c(C)nc(nc1Nc1ccc(CC(O)=O)cc1)-c1ccc(SC)s1
Show InChI InChI=1S/C20H21N3O2S2/c1-4-15-12(2)21-20(16-9-10-18(26-3)27-16)23-19(15)22-14-7-5-13(6-8-14)11-17(24)25/h5-10H,4,11H2,1-3H3,(H,24,25)(H,21,22,23)
n/an/a 1.50E+3n/an/an/an/an/an/a
Asahi Kasei Pharma Corporation
Curated by ChEMBL
Assay Description
Inhibition of human PDE4D3 incubated for 10 mins using cAMP and [3H]cAMP substrates
Bioorg Med Chem Lett 19: 3174-6 (2009)
Article DOI: 10.1016/j.bmcl.2009.04.121
BindingDB Entry DOI: 10.7270/Q26110NQ
cAMP-specific 3',5'-cyclic phosphodiesterase 4B
(Homo sapiens (Human))
BDBM50346119
(2-(4-(5-ethyl-6-methyl-2-(5-(methylthio)thiophen-2...)
Show SMILES CCc1c(C)nc(nc1Nc1ccc(CC(O)=O)cc1)-c1ccc(SC)s1
Show InChI InChI=1S/C20H21N3O2S2/c1-4-15-12(2)21-20(16-9-10-18(26-3)27-16)23-19(15)22-14-7-5-13(6-8-14)11-17(24)25/h5-10H,4,11H2,1-3H3,(H,24,25)(H,21,22,23)
n/an/a 34n/an/an/an/an/an/a
Asahi Kasei Pharma Corporation
Curated by ChEMBL
Assay Description
Inhibition of human PDE4B1 incubated for 10 mins using cAMP and [3H]cAMP substrates
Bioorg Med Chem Lett 19: 3174-6 (2009)
Article DOI: 10.1016/j.bmcl.2009.04.121
BindingDB Entry DOI: 10.7270/Q26110NQ