BDBM50346201 (4-Isopropyl-piperazin-1-yl)-(6-piperidin-1-ylmethylpyridin-3-yl)-methanone::CHEMBL1783893
SMILES: CC(C)N1CCN(CC1)C(=O)c1ccc(CN2CCCCC2)nc1
InChI Key: InChIKey=HGMKONUWLRPGDN-UHFFFAOYSA-N
Data: 2 KI  1 Kd
Activity Spreadsheet -- Enzyme Inhibition Constant Data from BindingDB
Found 3 hits for monomerid = 50346201
Trg + Lig
Ki
nM
ΔG°
kcal/mole
IC50
nM
Kd
nM
EC50/IC50
nM
koff
s-1
kon
M-1s-1
pHTemp
°C
Histamine H3 receptor
(Homo sapiens (Human))
BDBM50346201
((4-Isopropyl-piperazin-1-yl)-(6-piperidin-1-ylmeth...)
Show SMILES CC(C)N1CCN(CC1)C(=O)c1ccc(CN2CCCCC2)nc1
Show InChI InChI=1S/C19H30N4O/c1-16(2)22-10-12-23(13-11-22)19(24)17-6-7-18(20-14-17)15-21-8-4-3-5-9-21/h6-7,14,16H,3-5,8-13,15H2,1-2H3
Reactome pathway
1.10n/an/an/an/an/an/an/an/a
Johnson& Johnson Pharmaceutical Research and Development
Curated by ChEMBL
Assay Description
Displacement of [3H]N-alpha-methylhistamine from human histamine H3 receptor expressed in SK-N-MC cells
Eur J Med Chem 44: 4413-25 (2009)
Article DOI: 10.1016/j.ejmech.2009.06.007
BindingDB Entry DOI: 10.7270/Q28S4Q7C
Histamine H3 receptor
(Rattus norvegicus (rat))
BDBM50346201
((4-Isopropyl-piperazin-1-yl)-(6-piperidin-1-ylmeth...)
Show SMILES CC(C)N1CCN(CC1)C(=O)c1ccc(CN2CCCCC2)nc1
Show InChI InChI=1S/C19H30N4O/c1-16(2)22-10-12-23(13-11-22)19(24)17-6-7-18(20-14-17)15-21-8-4-3-5-9-21/h6-7,14,16H,3-5,8-13,15H2,1-2H3
Reactome pathway
10n/an/an/an/an/an/an/an/a
Johnson& Johnson Pharmaceutical Research and Development
Curated by ChEMBL
Assay Description
Displacement of [3H]N-alpha-methylhistamine from histamine H3 receptor in rat cortical hemispheres
Eur J Med Chem 44: 4413-25 (2009)
Article DOI: 10.1016/j.ejmech.2009.06.007
BindingDB Entry DOI: 10.7270/Q28S4Q7C
Histamine H3 receptor
(Rattus norvegicus (rat))
BDBM50346201
((4-Isopropyl-piperazin-1-yl)-(6-piperidin-1-ylmeth...)
Show SMILES CC(C)N1CCN(CC1)C(=O)c1ccc(CN2CCCCC2)nc1
Show InChI InChI=1S/C19H30N4O/c1-16(2)22-10-12-23(13-11-22)19(24)17-6-7-18(20-14-17)15-21-8-4-3-5-9-21/h6-7,14,16H,3-5,8-13,15H2,1-2H3
Reactome pathway
n/an/an/a 6.31n/an/an/an/an/a
Johnson& Johnson Pharmaceutical Research and Development
Curated by ChEMBL
Assay Description
Antagonist activity at histamine H3 receptor in rat cortical hemispheres assessed as inhibition of forskolin stimulated cAMP accumulation after 6 hrs
Eur J Med Chem 44: 4413-25 (2009)
Article DOI: 10.1016/j.ejmech.2009.06.007
BindingDB Entry DOI: 10.7270/Q28S4Q7C