BDBM50346327 (S)-2-(4-acetamido-3-oxo-4,5-dihydro-1H-benzo[c]azepin-2(3H)-yl)-N-(3,5-bis(trifluoromethyl)benzyl)acetamide::CHEMBL1782138
SMILES: CC(=O)N[C@H]1Cc2ccccc2CN(CC(=O)NCc2cc(cc(c2)C(F)(F)F)C(F)(F)F)C1=O
InChI Key: InChIKey=XQCHBKZHGOEFPQ-IBGZPJMESA-N
Data: 1 KI  1 Kd
Activity Spreadsheet -- Enzyme Inhibition Constant Data from BindingDB
Found 2 hits for monomerid = 50346327
Trg + Lig
Ki
nM
ΔG°
kcal/mole
IC50
nM
Kd
nM
EC50/IC50
nM
koff
s-1
kon
M-1s-1
pHTemp
°C
Neurokinin 1 receptor
(Homo sapiens (Human))
BDBM50346327
((S)-2-(4-acetamido-3-oxo-4,5-dihydro-1H-benzo[c]az...)
Show SMILES CC(=O)N[C@H]1Cc2ccccc2CN(CC(=O)NCc2cc(cc(c2)C(F)(F)F)C(F)(F)F)C1=O |r|
Show InChI InChI=1S/C23H21F6N3O3/c1-13(33)31-19-8-15-4-2-3-5-16(15)11-32(21(19)35)12-20(34)30-10-14-6-17(22(24,25)26)9-18(7-14)23(27,28)29/h2-7,9,19H,8,10-12H2,1H3,(H,30,34)(H,31,33)/t19-/m0/s1
Reactome pathway
387n/an/an/an/an/an/an/an/a
Vrije Universiteit Brussel
Curated by ChEMBL
Assay Description
Displacement of [3H]SP from human recombinant NK1 receptor expressed in CHO cells after 20 mins by liquid scintillation counting
J Med Chem 54: 2467-76 (2011)
Article DOI: 10.1021/jm1016285
BindingDB Entry DOI: 10.7270/Q2416XD1
Neurokinin 1 receptor
(Homo sapiens (Human))
BDBM50346327
((S)-2-(4-acetamido-3-oxo-4,5-dihydro-1H-benzo[c]az...)
Show SMILES CC(=O)N[C@H]1Cc2ccccc2CN(CC(=O)NCc2cc(cc(c2)C(F)(F)F)C(F)(F)F)C1=O |r|
Show InChI InChI=1S/C23H21F6N3O3/c1-13(33)31-19-8-15-4-2-3-5-16(15)11-32(21(19)35)12-20(34)30-10-14-6-17(22(24,25)26)9-18(7-14)23(27,28)29/h2-7,9,19H,8,10-12H2,1H3,(H,30,34)(H,31,33)/t19-/m0/s1
Reactome pathway
n/an/an/a 631n/an/an/an/an/a
Vrije Universiteit Brussel
Curated by ChEMBL
Assay Description
Antagonist activity at human NK1 receptor expressed in CHO-K1 cells assessed as inhibition of substance P-induced calcium-dependent aequorine lumines...
J Med Chem 54: 2467-76 (2011)
Article DOI: 10.1021/jm1016285
BindingDB Entry DOI: 10.7270/Q2416XD1