BDBM50346425 (1S,9aR)-1-((10H-phenothiazin-10-yl)methyl)-5-methyldecahydroquinolizinium iodide::CHEMBL1782709
SMILES: C[N+]12CCCC[C@@H]1[C@H](CN1c3ccccc3Sc3ccccc13)CCC2
InChI Key: InChIKey=WHBJMLSMNQEBKY-BBRSIGJESA-N
Data: 1 IC50
Activity Spreadsheet -- Enzyme Inhibition Constant Data from BindingDB
Found 1 hit for monomerid = 50346425
Trg + Lig
Ki
nM
ΔG°
kcal/mole
IC50
nM
Kd
nM
EC50/IC50
nM
koff
s-1
kon
M-1s-1
pHTemp
°C
Butyrylcholinesterase (BuChE)
(Equus caballus (Horse))
BDBM50346425
((1S,9aR)-1-((10H-phenothiazin-10-yl)methyl)-5-meth...)
Show SMILES C[N+]12CCCC[C@@H]1[C@H](CN1c3ccccc3Sc3ccccc13)CCC2 |r|
Show InChI InChI=1S/C23H29N2S/c1-25-15-7-6-12-21(25)18(9-8-16-25)17-24-19-10-2-4-13-22(19)26-23-14-5-3-11-20(23)24/h2-5,10-11,13-14,18,21H,6-9,12,15-17H2,1H3/q+1/t18-,21+,25?/m0/s1
n/an/a 510n/an/an/an/an/an/a
Universit£ degli Studi di Genova
Curated by ChEMBL
Assay Description
Inhibition of Equine serum BChE using butyrylthiocoline iodide as a substrate after 20 mins by Ellman's assay
Eur J Med Chem 46: 2170-84 (2011)
Article DOI: 10.1016/j.ejmech.2011.02.071
BindingDB Entry DOI: 10.7270/Q2BK1CPG