BDBM50346568 CHEMBL1795614
SMILES: Clc1ccc(cc1Cl)-n1sc2ncccc2c1=O
InChI Key: InChIKey=SICMOJZHIRIFCN-UHFFFAOYSA-N
Data: 1 IC50
Activity Spreadsheet -- Enzyme Inhibition Constant Data from BindingDB
Found 1 hit for monomerid = 50346568
Trg + Lig
Ki
nM
ΔG°
kcal/mole
IC50
nM
Kd
nM
EC50/IC50
nM
koff
s-1
kon
M-1s-1
pHTemp
°C
Histone acetyltransferase PCAF
(Homo sapiens (Human))
BDBM50346568
(CHEMBL1795614)
Show SMILES Clc1ccc(cc1Cl)-n1sc2ncccc2c1=O
Show InChI InChI=1S/C12H6Cl2N2OS/c13-9-4-3-7(6-10(9)14)16-12(17)8-2-1-5-15-11(8)18-16/h1-6H
NCI pathway
Reactome pathway
n/an/a 4.57E+3n/an/an/an/an/an/a
Albert-Ludwigs-University of Freiburg
Curated by ChEMBL
Assay Description
Inhibition of histone acetylase activity of human recombinant PCAF expressed in Escherichia coli using biotinylated oligopeptide sequences from histo...
Bioorg Med Chem 19: 3678-89 (2011)
Article DOI: 10.1016/j.bmc.2011.01.063
BindingDB Entry DOI: 10.7270/Q2NV9JKS