BDBM50346579 CHEMBL1795800
SMILES: Cc1ccc(cc1)-n1sc2cc(F)ccc2c1=O
InChI Key: InChIKey=XQPPJOAKKIVUQW-UHFFFAOYSA-N
Data: 1 IC50
Activity Spreadsheet -- Enzyme Inhibition Constant Data from BindingDB
Found 1 hit for monomerid = 50346579
Trg + Lig
Ki
nM
ΔG°
kcal/mole
IC50
nM
Kd
nM
EC50/IC50
nM
koff
s-1
kon
M-1s-1
pHTemp
°C
Histone acetyltransferase PCAF
(Homo sapiens (Human))
BDBM50346579
(CHEMBL1795800)
Show SMILES Cc1ccc(cc1)-n1sc2cc(F)ccc2c1=O
Show InChI InChI=1S/C14H10FNOS/c1-9-2-5-11(6-3-9)16-14(17)12-7-4-10(15)8-13(12)18-16/h2-8H,1H3
NCI pathway
Reactome pathway
n/an/a 3.69E+3n/an/an/an/an/an/a
Albert-Ludwigs-University of Freiburg
Curated by ChEMBL
Assay Description
Inhibition of histone acetylase activity of human recombinant PCAF expressed in Escherichia coli using biotinylated oligopeptide sequences from histo...
Bioorg Med Chem 19: 3678-89 (2011)
Article DOI: 10.1016/j.bmc.2011.01.063
BindingDB Entry DOI: 10.7270/Q2NV9JKS