BDBM50346821 CHEMBL1796012
SMILES: COc1cc(O)cc(CCc2ccc3OCOc3c2)c1
InChI Key: InChIKey=WXLWYVQONUUBMT-UHFFFAOYSA-N
Data: 1 IC50
Activity Spreadsheet -- Enzyme Inhibition Constant Data from BindingDB
Found 1 hit for monomerid = 50346821
Trg + Lig
Ki
nM
ΔG°
kcal/mole
IC50
nM
Kd
nM
EC50/IC50
nM
koff
s-1
kon
M-1s-1
pHTemp
°C
Calmodulin-2
(Homo sapiens (Human))
BDBM50346821
(CHEMBL1796012)
Show SMILES COc1cc(O)cc(CCc2ccc3OCOc3c2)c1
Show InChI InChI=1S/C16H16O4/c1-18-14-7-12(6-13(17)9-14)3-2-11-4-5-15-16(8-11)20-10-19-15/h4-9,17H,2-3,10H2,1H3
NCI pathway
Reactome pathway
n/an/a 3.13E+4n/an/an/an/an/an/a
Universidad Nacional Aut£noma de M£xico
Curated by ChEMBL
Assay Description
Inhibition of Calmodulin-dependent PDE1 activity assessed as inorganic phosphate release after 30 min
Eur J Med Chem 46: 2699-708 (2011)
Article DOI: 10.1016/j.ejmech.2011.03.057
BindingDB Entry DOI: 10.7270/Q2MW2HGD