null
SMILES: CC(C)COc1ccc(Cl)cc1C1CC1N
InChI Key: InChIKey=BVYLMDQBOJJSTN-UHFFFAOYSA-N
Activity Spreadsheet -- Enzyme Inhibition Constant Data from BindingDB
Found 2 hits for monomerid = 50346867
Trg + Lig
Ki
nM
ΔG°
kcal/mole
IC50
nM
Kd
nM
EC50/IC50
nM
koff
s-1
kon
M-1s-1
pHTemp
°C
Lysine-specific histone demethylase 1A
(Homo sapiens (Human))
BDBM50346867
(CHEMBL1797644 | S1402)
Show SMILES CC(C)COc1ccc(Cl)cc1C1CC1N
Show InChI InChI=1S/C13H18ClNO/c1-8(2)7-16-13-4-3-9(14)5-11(13)10-6-12(10)15/h3-5,8,10,12H,6-7,15H2,1-2H3
Reactome pathway
n/an/a 9.00E+3n/an/an/an/an/an/a
University of Copenhagen
Curated by ChEMBL
Assay Description
Inhibition of LSD1
Bioorg Med Chem 19: 3625-36 (2011)
Article DOI: 10.1016/j.bmc.2011.01.046
BindingDB Entry DOI: 10.7270/Q23X870S
Lysine-specific histone demethylase 1A
(Homo sapiens (Human))
BDBM50346867
(CHEMBL1797644 | S1402)
Show SMILES CC(C)COc1ccc(Cl)cc1C1CC1N
Show InChI InChI=1S/C13H18ClNO/c1-8(2)7-16-13-4-3-9(14)5-11(13)10-6-12(10)15/h3-5,8,10,12H,6-7,15H2,1-2H3
Reactome pathway
n/an/a 1.49E+4n/an/an/an/an/an/a
RIKEN Systems and Structural Biology Center
Assay Description
The kinetic inhibition parameters of LSD1 demethylase inhibition were obtained using the peroxidase-coupled reaction method.
Biochemistry 49: 6494-503 (2010)
Article DOI: 10.1021/bi100299r
BindingDB Entry DOI: 10.7270/Q2PK0DSZ