BDBM50346986 CHEMBL1796072
SMILES: Cn1ccc(cc1=O)[C@H]1CCNC[C@@H]1C(=O)N(Cc1c[nH]c2cccc(F)c12)C1CC1
InChI Key: InChIKey=HAHYRGODQYUCPB-MOPGFXCFSA-N
Data: 1 KI  2 IC50
Activity Spreadsheet -- Enzyme Inhibition Constant Data from BindingDB
Found 3 hits for monomerid = 50346986
Trg + Lig
Ki
nM
ΔG°
kcal/mole
IC50
nM
Kd
nM
EC50/IC50
nM
koff
s-1
kon
M-1s-1
pHTemp
°C
Potassium voltage-gated channel subfamily H member 2
(Homo sapiens (Human))
BDBM50346986
(CHEMBL1796072)
Show SMILES Cn1ccc(cc1=O)[C@H]1CCNC[C@@H]1C(=O)N(Cc1c[nH]c2cccc(F)c12)C1CC1 |r|
Show InChI InChI=1S/C24H27FN4O2/c1-28-10-8-15(11-22(28)30)18-7-9-26-13-19(18)24(31)29(17-5-6-17)14-16-12-27-21-4-2-3-20(25)23(16)21/h2-4,8,10-12,17-19,26-27H,5-7,9,13-14H2,1H3/t18-,19+/m1/s1
Reactome pathway
>2.90E+4n/an/an/an/an/an/an/an/a
Merck Frosst Centre for Therapeutic Research
Curated by ChEMBL
Assay Description
Inhibition of human ERG
Bioorg Med Chem Lett 21: 3970-5 (2011)
Article DOI: 10.1016/j.bmcl.2011.05.013
BindingDB Entry DOI: 10.7270/Q2PN9608
Renin
(Homo sapiens (Human))
BDBM50346986
(CHEMBL1796072)
Show SMILES Cn1ccc(cc1=O)[C@H]1CCNC[C@@H]1C(=O)N(Cc1c[nH]c2cccc(F)c12)C1CC1 |r|
Show InChI InChI=1S/C24H27FN4O2/c1-28-10-8-15(11-22(28)30)18-7-9-26-13-19(18)24(31)29(17-5-6-17)14-16-12-27-21-4-2-3-20(25)23(16)21/h2-4,8,10-12,17-19,26-27H,5-7,9,13-14H2,1H3/t18-,19+/m1/s1
Reactome pathway
n/an/a 12n/an/an/an/an/an/a
Merck Frosst Centre for Therapeutic Research
Curated by ChEMBL
Assay Description
Inhibition of human recombinant renin using Q-FRET substrate after 3 hrs by fluorescence assay
Bioorg Med Chem Lett 21: 3970-5 (2011)
Article DOI: 10.1016/j.bmcl.2011.05.013
BindingDB Entry DOI: 10.7270/Q2PN9608
Renin
(Homo sapiens (Human))
BDBM50346986
(CHEMBL1796072)
Show SMILES Cn1ccc(cc1=O)[C@H]1CCNC[C@@H]1C(=O)N(Cc1c[nH]c2cccc(F)c12)C1CC1 |r|
Show InChI InChI=1S/C24H27FN4O2/c1-28-10-8-15(11-22(28)30)18-7-9-26-13-19(18)24(31)29(17-5-6-17)14-16-12-27-21-4-2-3-20(25)23(16)21/h2-4,8,10-12,17-19,26-27H,5-7,9,13-14H2,1H3/t18-,19+/m1/s1
Reactome pathway
n/an/a 8.40n/an/an/an/an/an/a
Merck Frosst Centre for Therapeutic Research
Curated by ChEMBL
Assay Description
Inhibition of renin in human plasma using Q-FRET substrate pretreated for 10 mins before substrate addition measured after 1 hr
Bioorg Med Chem Lett 21: 3970-5 (2011)
Article DOI: 10.1016/j.bmcl.2011.05.013
BindingDB Entry DOI: 10.7270/Q2PN9608