BDBM50346990 CHEMBL1796077
SMILES: Cn1ccc(cc1=O)[C@H]1CCNC[C@@H]1C(=O)N(Cc1cn(Cc2cccnc2)c2cccc(F)c12)C1CC1
InChI Key: InChIKey=LSHIKKCNCJHIFH-RPBOFIJWSA-N
Data: 1 KI  2 IC50
Activity Spreadsheet -- Enzyme Inhibition Constant Data from BindingDB
Found 3 hits for monomerid = 50346990
Trg + Lig
Ki
nM
ΔG°
kcal/mole
IC50
nM
Kd
nM
EC50/IC50
nM
koff
s-1
kon
M-1s-1
pHTemp
°C
Potassium voltage-gated channel subfamily H member 2
(Homo sapiens (Human))
BDBM50346990
(CHEMBL1796077)
Show SMILES Cn1ccc(cc1=O)[C@H]1CCNC[C@@H]1C(=O)N(Cc1cn(Cc2cccnc2)c2cccc(F)c12)C1CC1 |r|
Show InChI InChI=1S/C30H32FN5O2/c1-34-13-10-21(14-28(34)37)24-9-12-33-16-25(24)30(38)36(23-7-8-23)19-22-18-35(17-20-4-3-11-32-15-20)27-6-2-5-26(31)29(22)27/h2-6,10-11,13-15,18,23-25,33H,7-9,12,16-17,19H2,1H3/t24-,25+/m1/s1
Reactome pathway
1.20E+4n/an/an/an/an/an/an/an/a
Merck Frosst Centre for Therapeutic Research
Curated by ChEMBL
Assay Description
Inhibition of human ERG
Bioorg Med Chem Lett 21: 3970-5 (2011)
Article DOI: 10.1016/j.bmcl.2011.05.013
BindingDB Entry DOI: 10.7270/Q2PN9608
Renin
(Homo sapiens (Human))
BDBM50346990
(CHEMBL1796077)
Show SMILES Cn1ccc(cc1=O)[C@H]1CCNC[C@@H]1C(=O)N(Cc1cn(Cc2cccnc2)c2cccc(F)c12)C1CC1 |r|
Show InChI InChI=1S/C30H32FN5O2/c1-34-13-10-21(14-28(34)37)24-9-12-33-16-25(24)30(38)36(23-7-8-23)19-22-18-35(17-20-4-3-11-32-15-20)27-6-2-5-26(31)29(22)27/h2-6,10-11,13-15,18,23-25,33H,7-9,12,16-17,19H2,1H3/t24-,25+/m1/s1
Reactome pathway
n/an/a 0.880n/an/an/an/an/an/a
Merck Frosst Centre for Therapeutic Research
Curated by ChEMBL
Assay Description
Inhibition of human recombinant renin using Q-FRET substrate after 3 hrs by fluorescence assay
Bioorg Med Chem Lett 21: 3970-5 (2011)
Article DOI: 10.1016/j.bmcl.2011.05.013
BindingDB Entry DOI: 10.7270/Q2PN9608
Renin
(Homo sapiens (Human))
BDBM50346990
(CHEMBL1796077)
Show SMILES Cn1ccc(cc1=O)[C@H]1CCNC[C@@H]1C(=O)N(Cc1cn(Cc2cccnc2)c2cccc(F)c12)C1CC1 |r|
Show InChI InChI=1S/C30H32FN5O2/c1-34-13-10-21(14-28(34)37)24-9-12-33-16-25(24)30(38)36(23-7-8-23)19-22-18-35(17-20-4-3-11-32-15-20)27-6-2-5-26(31)29(22)27/h2-6,10-11,13-15,18,23-25,33H,7-9,12,16-17,19H2,1H3/t24-,25+/m1/s1
Reactome pathway
n/an/a 2n/an/an/an/an/an/a
Merck Frosst Centre for Therapeutic Research
Curated by ChEMBL
Assay Description
Inhibition of renin in human plasma using Q-FRET substrate pretreated for 10 mins before substrate addition measured after 1 hr
Bioorg Med Chem Lett 21: 3970-5 (2011)
Article DOI: 10.1016/j.bmcl.2011.05.013
BindingDB Entry DOI: 10.7270/Q2PN9608