BDBM50347007 CHEMBL1796060
SMILES: COCCNc1cc(Cl)c(Cl)c(CN(C2CC2)C(=O)[C@H]2CNCC[C@@H]2c2ccn(C)c(=O)c2)c1
InChI Key: InChIKey=RJAJLJQGZUGFPU-RTWAWAEBSA-N
Data: 1 KI  2 IC50
Activity Spreadsheet -- Enzyme Inhibition Constant Data from BindingDB
Found 3 hits for monomerid = 50347007
Trg + Lig
Ki
nM
ΔG°
kcal/mole
IC50
nM
Kd
nM
EC50/IC50
nM
koff
s-1
kon
M-1s-1
pHTemp
°C
Potassium voltage-gated channel subfamily H member 2
(Homo sapiens (Human))
BDBM50347007
(CHEMBL1796060)
Show SMILES COCCNc1cc(Cl)c(Cl)c(CN(C2CC2)C(=O)[C@H]2CNCC[C@@H]2c2ccn(C)c(=O)c2)c1 |r|
Show InChI InChI=1S/C25H32Cl2N4O3/c1-30-9-6-16(12-23(30)32)20-5-7-28-14-21(20)25(33)31(19-3-4-19)15-17-11-18(29-8-10-34-2)13-22(26)24(17)27/h6,9,11-13,19-21,28-29H,3-5,7-8,10,14-15H2,1-2H3/t20-,21+/m1/s1
Reactome pathway
1.80E+4n/an/an/an/an/an/an/an/a
Merck Frosst Centre for Therapeutic Research
Curated by ChEMBL
Assay Description
Inhibition of human ERG
Bioorg Med Chem Lett 21: 3970-5 (2011)
Article DOI: 10.1016/j.bmcl.2011.05.013
BindingDB Entry DOI: 10.7270/Q2PN9608
Renin
(Homo sapiens (Human))
BDBM50347007
(CHEMBL1796060)
Show SMILES COCCNc1cc(Cl)c(Cl)c(CN(C2CC2)C(=O)[C@H]2CNCC[C@@H]2c2ccn(C)c(=O)c2)c1 |r|
Show InChI InChI=1S/C25H32Cl2N4O3/c1-30-9-6-16(12-23(30)32)20-5-7-28-14-21(20)25(33)31(19-3-4-19)15-17-11-18(29-8-10-34-2)13-22(26)24(17)27/h6,9,11-13,19-21,28-29H,3-5,7-8,10,14-15H2,1-2H3/t20-,21+/m1/s1
Reactome pathway
n/an/a 26n/an/an/an/an/an/a
Merck Frosst Centre for Therapeutic Research
Curated by ChEMBL
Assay Description
Inhibition of renin in human plasma using Q-FRET substrate pretreated for 10 mins before substrate addition measured after 1 hr
Bioorg Med Chem Lett 21: 3970-5 (2011)
Article DOI: 10.1016/j.bmcl.2011.05.013
BindingDB Entry DOI: 10.7270/Q2PN9608
Renin
(Homo sapiens (Human))
BDBM50347007
(CHEMBL1796060)
Show SMILES COCCNc1cc(Cl)c(Cl)c(CN(C2CC2)C(=O)[C@H]2CNCC[C@@H]2c2ccn(C)c(=O)c2)c1 |r|
Show InChI InChI=1S/C25H32Cl2N4O3/c1-30-9-6-16(12-23(30)32)20-5-7-28-14-21(20)25(33)31(19-3-4-19)15-17-11-18(29-8-10-34-2)13-22(26)24(17)27/h6,9,11-13,19-21,28-29H,3-5,7-8,10,14-15H2,1-2H3/t20-,21+/m1/s1
Reactome pathway
n/an/a 7.10n/an/an/an/an/an/a
Merck Frosst Centre for Therapeutic Research
Curated by ChEMBL
Assay Description
Inhibition of renin in human plasma using Q-FRET substrate pretreated for 10 mins before substrate addition measured after 1 hr
Bioorg Med Chem Lett 21: 3970-5 (2011)
Article DOI: 10.1016/j.bmcl.2011.05.013
BindingDB Entry DOI: 10.7270/Q2PN9608