BDBM50347011 CHEMBL1796064
SMILES: COCCCc1cc(CN(C2CC2)C(=O)[C@H]2CNCC[C@@H]2c2ccn(C)c(=O)c2)cc(c1)-c1ccccc1
InChI Key: InChIKey=JVIJZLPTVSWJDD-IHLOFXLRSA-N
Data: 1 KI  2 IC50
Activity Spreadsheet -- Enzyme Inhibition Constant Data from BindingDB
Found 3 hits for monomerid = 50347011
Trg + Lig
Ki
nM
ΔG°
kcal/mole
IC50
nM
Kd
nM
EC50/IC50
nM
koff
s-1
kon
M-1s-1
pHTemp
°C
Potassium voltage-gated channel subfamily H member 2
(Homo sapiens (Human))
BDBM50347011
(CHEMBL1796064)
Show SMILES COCCCc1cc(CN(C2CC2)C(=O)[C@H]2CNCC[C@@H]2c2ccn(C)c(=O)c2)cc(c1)-c1ccccc1 |r|
Show InChI InChI=1S/C32H39N3O3/c1-34-15-13-26(20-31(34)36)29-12-14-33-21-30(29)32(37)35(28-10-11-28)22-24-17-23(7-6-16-38-2)18-27(19-24)25-8-4-3-5-9-25/h3-5,8-9,13,15,17-20,28-30,33H,6-7,10-12,14,16,21-22H2,1-2H3/t29-,30+/m1/s1
Reactome pathway
1.70E+3n/an/an/an/an/an/an/an/a
Merck Frosst Centre for Therapeutic Research
Curated by ChEMBL
Assay Description
Inhibition of human ERG
Bioorg Med Chem Lett 21: 3970-5 (2011)
Article DOI: 10.1016/j.bmcl.2011.05.013
BindingDB Entry DOI: 10.7270/Q2PN9608
Renin
(Homo sapiens (Human))
BDBM50347011
(CHEMBL1796064)
Show SMILES COCCCc1cc(CN(C2CC2)C(=O)[C@H]2CNCC[C@@H]2c2ccn(C)c(=O)c2)cc(c1)-c1ccccc1 |r|
Show InChI InChI=1S/C32H39N3O3/c1-34-15-13-26(20-31(34)36)29-12-14-33-21-30(29)32(37)35(28-10-11-28)22-24-17-23(7-6-16-38-2)18-27(19-24)25-8-4-3-5-9-25/h3-5,8-9,13,15,17-20,28-30,33H,6-7,10-12,14,16,21-22H2,1-2H3/t29-,30+/m1/s1
Reactome pathway
n/an/a 18n/an/an/an/an/an/a
Merck Frosst Centre for Therapeutic Research
Curated by ChEMBL
Assay Description
Inhibition of human recombinant renin using Q-FRET substrate after 3 hrs by fluorescence assay
Bioorg Med Chem Lett 21: 3970-5 (2011)
Article DOI: 10.1016/j.bmcl.2011.05.013
BindingDB Entry DOI: 10.7270/Q2PN9608
Renin
(Homo sapiens (Human))
BDBM50347011
(CHEMBL1796064)
Show SMILES COCCCc1cc(CN(C2CC2)C(=O)[C@H]2CNCC[C@@H]2c2ccn(C)c(=O)c2)cc(c1)-c1ccccc1 |r|
Show InChI InChI=1S/C32H39N3O3/c1-34-15-13-26(20-31(34)36)29-12-14-33-21-30(29)32(37)35(28-10-11-28)22-24-17-23(7-6-16-38-2)18-27(19-24)25-8-4-3-5-9-25/h3-5,8-9,13,15,17-20,28-30,33H,6-7,10-12,14,16,21-22H2,1-2H3/t29-,30+/m1/s1
Reactome pathway
n/an/a 81n/an/an/an/an/an/a
Merck Frosst Centre for Therapeutic Research
Curated by ChEMBL
Assay Description
Inhibition of renin in human plasma using Q-FRET substrate pretreated for 10 mins before substrate addition measured after 1 hr
Bioorg Med Chem Lett 21: 3970-5 (2011)
Article DOI: 10.1016/j.bmcl.2011.05.013
BindingDB Entry DOI: 10.7270/Q2PN9608