BDBM50347106 CHEMBL1797209
SMILES: Cc1cc(OCc2ccc(F)cc2F)c(Br)c(=O)n1-c1c(F)cc(OCC(N)=O)cc1F
InChI Key: InChIKey=LOAZSAQHNGGVGI-UHFFFAOYSA-N
Data: 1 IC50
Activity Spreadsheet -- Enzyme Inhibition Constant Data from BindingDB
Found 1 hit for monomerid = 50347106
Trg + Lig
Ki
nM
ΔG°
kcal/mole
IC50
nM
Kd
nM
EC50/IC50
nM
koff
s-1
kon
M-1s-1
pHTemp
°C
Mitogen-activated protein kinase 14
(Homo sapiens (Human))
BDBM50347106
(CHEMBL1797209)
Show SMILES Cc1cc(OCc2ccc(F)cc2F)c(Br)c(=O)n1-c1c(F)cc(OCC(N)=O)cc1F |(24.13,3.5,;22.79,2.74,;21.47,3.52,;20.14,2.74,;18.8,3.5,;17.47,2.73,;16.13,3.5,;14.81,2.72,;13.48,3.48,;13.47,5.03,;12.13,5.79,;14.8,5.8,;16.14,5.03,;17.47,5.8,;20.14,1.2,;18.8,.43,;21.47,.44,;21.47,-1.1,;22.79,1.2,;24.13,.43,;25.45,1.19,;25.45,2.73,;26.78,.43,;26.79,-1.12,;28.12,-1.89,;29.45,-1.12,;30.79,-1.89,;32.12,-1.12,;30.79,-3.43,;25.45,-1.89,;24.12,-1.11,;22.78,-1.88,)|
Show InChI InChI=1S/C21H15BrF4N2O4/c1-10-4-17(32-8-11-2-3-12(23)5-14(11)24)19(22)21(30)28(10)20-15(25)6-13(7-16(20)26)31-9-18(27)29/h2-7H,8-9H2,1H3,(H2,27,29)
NCI pathway
Reactome pathway
n/an/a 3n/an/an/an/an/an/a
Pfizer Inc.
Curated by ChEMBL
Assay Description
Inhibition of p38alpha assessed as phosphorylation of fluorescently-labelled MK2 using Hsp27 peptide as substrate after 60 mins by fluorescence assay
Bioorg Med Chem Lett 21: 4059-65 (2011)
Article DOI: 10.1016/j.bmcl.2011.04.120
BindingDB Entry DOI: 10.7270/Q25Q4WFH