BDBM50347195 CHEMBL1795747
SMILES: O=c1nc(oc2cc3ccc(OCc4ccccn4)cc3cc12)N1CCOCC1
InChI Key: InChIKey=DUORGXXGXXKMBC-UHFFFAOYSA-N
Data: 1 IC50
Activity Spreadsheet -- Enzyme Inhibition Constant Data from BindingDB
Found 1 hit for monomerid = 50347195
Trg + Lig
Ki
nM
ΔG°
kcal/mole
IC50
nM
Kd
nM
EC50/IC50
nM
koff
s-1
kon
M-1s-1
pHTemp
°C
DNA-dependent protein kinase catalytic subunit
(Homo sapiens (Human))
BDBM50347195
(CHEMBL1795747)
Show SMILES O=c1nc(oc2cc3ccc(OCc4ccccn4)cc3cc12)N1CCOCC1
Show InChI InChI=1S/C22H19N3O4/c26-21-19-12-16-11-18(28-14-17-3-1-2-6-23-17)5-4-15(16)13-20(19)29-22(24-21)25-7-9-27-10-8-25/h1-6,11-13H,7-10,14H2
n/an/a 96n/an/an/an/an/an/a
La Trobe University
Curated by ChEMBL
Assay Description
Inhibition of purified DNA-PK by ADP-Glo Kinase assay
Bioorg Med Chem 19: 3983-94 (2011)
Article DOI: 10.1016/j.bmc.2011.05.032
BindingDB Entry DOI: 10.7270/Q20Z73M7