BDBM50347197 CHEMBL1795749
SMILES: O=c1nc(oc2cc3c(OCc4ccccn4)cccc3cc12)N1CCOCC1
InChI Key: InChIKey=DIOIDXONYOWLRX-UHFFFAOYSA-N
Data: 1 IC50
Activity Spreadsheet -- Enzyme Inhibition Constant Data from BindingDB
Found 1 hit for monomerid = 50347197
Trg + Lig
Ki
nM
ΔG°
kcal/mole
IC50
nM
Kd
nM
EC50/IC50
nM
koff
s-1
kon
M-1s-1
pHTemp
°C
DNA-dependent protein kinase catalytic subunit
(Homo sapiens (Human))
BDBM50347197
(CHEMBL1795749)
Show SMILES O=c1nc(oc2cc3c(OCc4ccccn4)cccc3cc12)N1CCOCC1
Show InChI InChI=1S/C22H19N3O4/c26-21-18-12-15-4-3-6-19(28-14-16-5-1-2-7-23-16)17(15)13-20(18)29-22(24-21)25-8-10-27-11-9-25/h1-7,12-13H,8-11,14H2
n/an/a 930n/an/an/an/an/an/a
La Trobe University
Curated by ChEMBL
Assay Description
Inhibition of purified DNA-PK by ADP-Glo Kinase assay
Bioorg Med Chem 19: 3983-94 (2011)
Article DOI: 10.1016/j.bmc.2011.05.032
BindingDB Entry DOI: 10.7270/Q20Z73M7