BDBM50347243 CHEMBL1795950
SMILES: CC(C)(C)OC(=O)N[C@@H](COCc1cn(nn1)[C@@H]1O[C@H](COCc2ccccc2)[C@@H](OCc2ccccc2)[C@H](OCc2ccccc2)[C@H]1OCc1ccccc1)C(O)=O
InChI Key: InChIKey=XHOYZEPHJFVHSU-SHNSUYAESA-N
Data: 1 KI  7 IC50
Activity Spreadsheet -- Enzyme Inhibition Constant Data from BindingDB
Found 8 hits for monomerid = 50347243
Trg + Lig
Ki
nM
ΔG°
kcal/mole
IC50
nM
Kd
nM
EC50/IC50
nM
koff
s-1
kon
M-1s-1
pHTemp
°C
Protein-tyrosine phosphatase 1B
(Homo sapiens (Human))
BDBM50347243
(CHEMBL1795950)
Show SMILES CC(C)(C)OC(=O)N[C@@H](COCc1cn(nn1)[C@@H]1O[C@H](COCc2ccccc2)[C@@H](OCc2ccccc2)[C@H](OCc2ccccc2)[C@H]1OCc1ccccc1)C(O)=O |r|
Show InChI InChI=1S/C45H52N4O10/c1-45(2,3)59-44(52)46-37(43(50)51)30-54-29-36-24-49(48-47-36)42-41(57-28-35-22-14-7-15-23-35)40(56-27-34-20-12-6-13-21-34)39(55-26-33-18-10-5-11-19-33)38(58-42)31-53-25-32-16-8-4-9-17-32/h4-24,37-42H,25-31H2,1-3H3,(H,46,52)(H,50,51)/t37-,38+,39+,40-,41+,42+/m0/s1
NCI pathway
Reactome pathway
3.90E+3n/an/an/an/an/an/a6.5n/a
East China University of Science and Technology
Curated by ChEMBL
Assay Description
Competitive inhibition of human recombinant PTB1B catalytic domain using pNPP substrate at 30 degC and pH 6.5 by Eadie-Hofstee plot
Bioorg Med Chem 19: 3892-900 (2011)
Article DOI: 10.1016/j.bmc.2011.05.049
BindingDB Entry DOI: 10.7270/Q2RJ4JTV
Dual specificity phosphatase Cdc25B
(Homo sapiens (Human))
BDBM50347243
(CHEMBL1795950)
Show SMILES CC(C)(C)OC(=O)N[C@@H](COCc1cn(nn1)[C@@H]1O[C@H](COCc2ccccc2)[C@@H](OCc2ccccc2)[C@H](OCc2ccccc2)[C@H]1OCc1ccccc1)C(O)=O |r|
Show InChI InChI=1S/C45H52N4O10/c1-45(2,3)59-44(52)46-37(43(50)51)30-54-29-36-24-49(48-47-36)42-41(57-28-35-22-14-7-15-23-35)40(56-27-34-20-12-6-13-21-34)39(55-26-33-18-10-5-11-19-33)38(58-42)31-53-25-32-16-8-4-9-17-32/h4-24,37-42H,25-31H2,1-3H3,(H,46,52)(H,50,51)/t37-,38+,39+,40-,41+,42+/m0/s1
Reactome pathway
n/an/a 6.20E+3n/an/an/an/an/an/a
East China University of Science and Technology
Curated by ChEMBL
Assay Description
Inhibition of human Cdc25B
Bioorg Med Chem 19: 3892-900 (2011)
Article DOI: 10.1016/j.bmc.2011.05.049
BindingDB Entry DOI: 10.7270/Q2RJ4JTV
Tyrosine-protein phosphatase non-receptor type 2
(Homo sapiens (Human))
BDBM50347243
(CHEMBL1795950)
Show SMILES CC(C)(C)OC(=O)N[C@@H](COCc1cn(nn1)[C@@H]1O[C@H](COCc2ccccc2)[C@@H](OCc2ccccc2)[C@H](OCc2ccccc2)[C@H]1OCc1ccccc1)C(O)=O |r|
Show InChI InChI=1S/C45H52N4O10/c1-45(2,3)59-44(52)46-37(43(50)51)30-54-29-36-24-49(48-47-36)42-41(57-28-35-22-14-7-15-23-35)40(56-27-34-20-12-6-13-21-34)39(55-26-33-18-10-5-11-19-33)38(58-42)31-53-25-32-16-8-4-9-17-32/h4-24,37-42H,25-31H2,1-3H3,(H,46,52)(H,50,51)/t37-,38+,39+,40-,41+,42+/m0/s1
n/an/a 1.25E+4n/an/an/an/an/an/a
East China University of Science and Technology
Curated by ChEMBL
Assay Description
Inhibition of TCPTP
Bioorg Med Chem 19: 3892-900 (2011)
Article DOI: 10.1016/j.bmc.2011.05.049
BindingDB Entry DOI: 10.7270/Q2RJ4JTV
Protein-tyrosine phosphatase 1C
(Homo sapiens (Human))
BDBM50347243
(CHEMBL1795950)
Show SMILES CC(C)(C)OC(=O)N[C@@H](COCc1cn(nn1)[C@@H]1O[C@H](COCc2ccccc2)[C@@H](OCc2ccccc2)[C@H](OCc2ccccc2)[C@H]1OCc1ccccc1)C(O)=O |r|
Show InChI InChI=1S/C45H52N4O10/c1-45(2,3)59-44(52)46-37(43(50)51)30-54-29-36-24-49(48-47-36)42-41(57-28-35-22-14-7-15-23-35)40(56-27-34-20-12-6-13-21-34)39(55-26-33-18-10-5-11-19-33)38(58-42)31-53-25-32-16-8-4-9-17-32/h4-24,37-42H,25-31H2,1-3H3,(H,46,52)(H,50,51)/t37-,38+,39+,40-,41+,42+/m0/s1
Reactome pathway
n/an/a 4.04E+4n/an/an/an/an/an/a
East China University of Science and Technology
Curated by ChEMBL
Assay Description
Inhibition of SHP1
Bioorg Med Chem 19: 3892-900 (2011)
Article DOI: 10.1016/j.bmc.2011.05.049
BindingDB Entry DOI: 10.7270/Q2RJ4JTV
Tyrosine-protein phosphatase non-receptor type 11
(Homo sapiens (Human))
BDBM50347243
(CHEMBL1795950)
Show SMILES CC(C)(C)OC(=O)N[C@@H](COCc1cn(nn1)[C@@H]1O[C@H](COCc2ccccc2)[C@@H](OCc2ccccc2)[C@H](OCc2ccccc2)[C@H]1OCc1ccccc1)C(O)=O |r|
Show InChI InChI=1S/C45H52N4O10/c1-45(2,3)59-44(52)46-37(43(50)51)30-54-29-36-24-49(48-47-36)42-41(57-28-35-22-14-7-15-23-35)40(56-27-34-20-12-6-13-21-34)39(55-26-33-18-10-5-11-19-33)38(58-42)31-53-25-32-16-8-4-9-17-32/h4-24,37-42H,25-31H2,1-3H3,(H,46,52)(H,50,51)/t37-,38+,39+,40-,41+,42+/m0/s1
NCI pathway
Reactome pathway
n/an/a 4.76E+4n/an/an/an/an/an/a
East China University of Science and Technology
Curated by ChEMBL
Assay Description
Inhibition of SHP2
Bioorg Med Chem 19: 3892-900 (2011)
Article DOI: 10.1016/j.bmc.2011.05.049
BindingDB Entry DOI: 10.7270/Q2RJ4JTV
Receptor-type tyrosine-protein phosphatase F (LAR)
(Homo sapiens (Human))
BDBM50347243
(CHEMBL1795950)
Show SMILES CC(C)(C)OC(=O)N[C@@H](COCc1cn(nn1)[C@@H]1O[C@H](COCc2ccccc2)[C@@H](OCc2ccccc2)[C@H](OCc2ccccc2)[C@H]1OCc1ccccc1)C(O)=O |r|
Show InChI InChI=1S/C45H52N4O10/c1-45(2,3)59-44(52)46-37(43(50)51)30-54-29-36-24-49(48-47-36)42-41(57-28-35-22-14-7-15-23-35)40(56-27-34-20-12-6-13-21-34)39(55-26-33-18-10-5-11-19-33)38(58-42)31-53-25-32-16-8-4-9-17-32/h4-24,37-42H,25-31H2,1-3H3,(H,46,52)(H,50,51)/t37-,38+,39+,40-,41+,42+/m0/s1
n/an/a>1.20E+5n/an/an/an/an/an/a
East China University of Science and Technology
Curated by ChEMBL
Assay Description
Inhibition of human LAR
Bioorg Med Chem 19: 3892-900 (2011)
Article DOI: 10.1016/j.bmc.2011.05.049
BindingDB Entry DOI: 10.7270/Q2RJ4JTV
Protein-tyrosine phosphatase 1B
(Homo sapiens (Human))
BDBM50347243
(CHEMBL1795950)
Show SMILES CC(C)(C)OC(=O)N[C@@H](COCc1cn(nn1)[C@@H]1O[C@H](COCc2ccccc2)[C@@H](OCc2ccccc2)[C@H](OCc2ccccc2)[C@H]1OCc1ccccc1)C(O)=O |r|
Show InChI InChI=1S/C45H52N4O10/c1-45(2,3)59-44(52)46-37(43(50)51)30-54-29-36-24-49(48-47-36)42-41(57-28-35-22-14-7-15-23-35)40(56-27-34-20-12-6-13-21-34)39(55-26-33-18-10-5-11-19-33)38(58-42)31-53-25-32-16-8-4-9-17-32/h4-24,37-42H,25-31H2,1-3H3,(H,46,52)(H,50,51)/t37-,38+,39+,40-,41+,42+/m0/s1
NCI pathway
Reactome pathway
n/an/a 5.90E+3n/an/an/an/an/an/a
East China University of Science and Technology
Curated by ChEMBL
Assay Description
Inhibition of human recombinant PTB1B catalytic domain using pNPP substrate
Bioorg Med Chem 19: 3892-900 (2011)
Article DOI: 10.1016/j.bmc.2011.05.049
BindingDB Entry DOI: 10.7270/Q2RJ4JTV
phosphatase Cdc25
(Homo sapiens (Human))
BDBM50347243
(CHEMBL1795950)
Show SMILES CC(C)(C)OC(=O)N[C@@H](COCc1cn(nn1)[C@@H]1O[C@H](COCc2ccccc2)[C@@H](OCc2ccccc2)[C@H](OCc2ccccc2)[C@H]1OCc1ccccc1)C(O)=O |r|
Show InChI InChI=1S/C45H52N4O10/c1-45(2,3)59-44(52)46-37(43(50)51)30-54-29-36-24-49(48-47-36)42-41(57-28-35-22-14-7-15-23-35)40(56-27-34-20-12-6-13-21-34)39(55-26-33-18-10-5-11-19-33)38(58-42)31-53-25-32-16-8-4-9-17-32/h4-24,37-42H,25-31H2,1-3H3,(H,46,52)(H,50,51)/t37-,38+,39+,40-,41+,42+/m0/s1
Reactome pathway
n/an/a 2.43E+4n/an/an/an/an/an/a
East China University of Science and Technology
Curated by ChEMBL
Assay Description
Inhibition of human CDC25A
Bioorg Med Chem 19: 3892-900 (2011)
Article DOI: 10.1016/j.bmc.2011.05.049
BindingDB Entry DOI: 10.7270/Q2RJ4JTV