BDBM50347260 CHEMBL1706296
SMILES: Clc1cccc(CN2c3cc(ccc3S(=O)c3ccccc3C2=O)C(=O)NCCCN2CCCC2)c1
InChI Key: InChIKey=RAXSRGJYBRXWEH-UHFFFAOYSA-N
Data: 1 IC50
Activity Spreadsheet -- Enzyme Inhibition Constant Data from BindingDB
Found 1 hit for monomerid = 50347260
Trg + Lig
Ki
nM
ΔG°
kcal/mole
IC50
nM
Kd
nM
EC50/IC50
nM
koff
s-1
kon
M-1s-1
pHTemp
°C
L-cysteine:1D-myo-inositol 2-amino-2-deoxy-alpha-D-glucopyranoside ligase
(Mycobacterium tuberculosis)
BDBM50347260
(CHEMBL1706296)
Show SMILES Clc1cccc(CN2c3cc(ccc3S(=O)c3ccccc3C2=O)C(=O)NCCCN2CCCC2)c1
Show InChI InChI=1S/C28H28ClN3O3S/c29-22-8-5-7-20(17-22)19-32-24-18-21(27(33)30-13-6-16-31-14-3-4-15-31)11-12-26(24)36(35)25-10-2-1-9-23(25)28(32)34/h1-2,5,7-12,17-18H,3-4,6,13-16,19H2,(H,30,33)
Reactome pathway
n/an/a 1.00E+5n/an/an/an/an/an/a
University of California
Curated by ChEMBL
Assay Description
Inhibition of Mycobacterium tuberculosis recombinant MshC assessed as production of Cys-GlcN-Ins from cysteine by HPLC based fluorescence assay
Bioorg Med Chem 19: 3956-64 (2011)
Article DOI: 10.1016/j.bmc.2011.05.028
BindingDB Entry DOI: 10.7270/Q2MS3T40