BDBM50347272 CHEMBL1329194
SMILES: CCCN(CCC)CCCNC(=O)c1ccc2c(c1)N(CC)C(=O)c1ccccc1S2=O
InChI Key: InChIKey=JOUOMWRMSLNINZ-UHFFFAOYSA-N
Data: 1 IC50
Activity Spreadsheet -- Enzyme Inhibition Constant Data from BindingDB
Found 1 hit for monomerid = 50347272
Trg + Lig
Ki
nM
ΔG°
kcal/mole
IC50
nM
Kd
nM
EC50/IC50
nM
koff
s-1
kon
M-1s-1
pHTemp
°C
L-cysteine:1D-myo-inositol 2-amino-2-deoxy-alpha-D-glucopyranoside ligase
(Mycobacterium tuberculosis)
BDBM50347272
(CHEMBL1329194)
Show SMILES CCCN(CCC)CCCNC(=O)c1ccc2c(c1)N(CC)C(=O)c1ccccc1S2=O
Show InChI InChI=1S/C25H33N3O3S/c1-4-15-27(16-5-2)17-9-14-26-24(29)19-12-13-23-21(18-19)28(6-3)25(30)20-10-7-8-11-22(20)32(23)31/h7-8,10-13,18H,4-6,9,14-17H2,1-3H3,(H,26,29)
Reactome pathway
n/an/a>3.00E+6n/an/an/an/an/an/a
University of California
Curated by ChEMBL
Assay Description
Inhibition of Mycobacterium tuberculosis recombinant MshC assessed as production of Cys-GlcN-Ins from cysteine by HPLC based fluorescence assay
Bioorg Med Chem 19: 3956-64 (2011)
Article DOI: 10.1016/j.bmc.2011.05.028
BindingDB Entry DOI: 10.7270/Q2MS3T40