BDBM50347273 CHEMBL1796123
SMILES: CCN1c2cc(ccc2S(=O)c2ccccc2C1=O)C(=O)NCCCN1CCOCC1
InChI Key: InChIKey=CTHMMJGYXMGVEX-UHFFFAOYSA-N
Data: 1 IC50
Activity Spreadsheet -- Enzyme Inhibition Constant Data from BindingDB
Found 1 hit for monomerid = 50347273
Trg + Lig
Ki
nM
ΔG°
kcal/mole
IC50
nM
Kd
nM
EC50/IC50
nM
koff
s-1
kon
M-1s-1
pHTemp
°C
L-cysteine:1D-myo-inositol 2-amino-2-deoxy-alpha-D-glucopyranoside ligase
(Mycobacterium tuberculosis)
BDBM50347273
(CHEMBL1796123)
Show SMILES CCN1c2cc(ccc2S(=O)c2ccccc2C1=O)C(=O)NCCCN1CCOCC1
Show InChI InChI=1S/C23H27N3O4S/c1-2-26-19-16-17(22(27)24-10-5-11-25-12-14-30-15-13-25)8-9-21(19)31(29)20-7-4-3-6-18(20)23(26)28/h3-4,6-9,16H,2,5,10-15H2,1H3,(H,24,27)
Reactome pathway
n/an/a>3.00E+6n/an/an/an/an/an/a
University of California
Curated by ChEMBL
Assay Description
Inhibition of Mycobacterium tuberculosis recombinant MshC assessed as production of Cys-GlcN-Ins from cysteine by HPLC based fluorescence assay
Bioorg Med Chem 19: 3956-64 (2011)
Article DOI: 10.1016/j.bmc.2011.05.028
BindingDB Entry DOI: 10.7270/Q2MS3T40