BDBM50347469 CHEMBL1802258
SMILES: Oc1cc(Br)c(Br)c2nc3ccccc3nc12
InChI Key: InChIKey=XDGQFLAUZQHCFX-UHFFFAOYSA-N
Data: 1 IC50
Activity Spreadsheet -- Enzyme Inhibition Constant Data from BindingDB
Found 1 hit for monomerid = 50347469
Trg + Lig
Ki
nM
ΔG°
kcal/mole
IC50
nM
Kd
nM
EC50/IC50
nM
koff
s-1
kon
M-1s-1
pHTemp
°C
Ribosyldihydronicotinamide dehydrogenase [quinone]
(Homo sapiens (Human))
BDBM50347469
(CHEMBL1802258)
Show SMILES Oc1cc(Br)c(Br)c2nc3ccccc3nc12
Show InChI InChI=1S/C12H6Br2N2O/c13-6-5-9(17)11-12(10(6)14)16-8-4-2-1-3-7(8)15-11/h1-5,17H
n/an/a 1.40E+3n/an/an/an/an/an/a
Purdue University
Curated by ChEMBL
Assay Description
Inhibition of human QR2 expressed in Escherichia coli BL21 (DE3) using MTT and NMeH as substrate assessed as formazan formation
J Med Chem 53: 8688-99 (2010)
Article DOI: 10.1021/jm1011066
BindingDB Entry DOI: 10.7270/Q2TB178C