BDBM50347475 CHEMBL1802263
SMILES: COc1cc2nc3ccccc3nc2cc1OC
InChI Key: InChIKey=YQIADNJBCIVZAI-UHFFFAOYSA-N
Data: 1 IC50
Activity Spreadsheet -- Enzyme Inhibition Constant Data from BindingDB
Found 1 hit for monomerid = 50347475
Trg + Lig
Ki
nM
ΔG°
kcal/mole
IC50
nM
Kd
nM
EC50/IC50
nM
koff
s-1
kon
M-1s-1
pHTemp
°C
Ribosyldihydronicotinamide dehydrogenase [quinone]
(Homo sapiens (Human))
BDBM50347475
(CHEMBL1802263)
Show SMILES COc1cc2nc3ccccc3nc2cc1OC
Show InChI InChI=1S/C14H12N2O2/c1-17-13-7-11-12(8-14(13)18-2)16-10-6-4-3-5-9(10)15-11/h3-8H,1-2H3
n/an/a 1.82E+4n/an/an/an/an/an/a
Purdue University
Curated by ChEMBL
Assay Description
Inhibition of human QR2 expressed in Escherichia coli BL21 (DE3) using MTT and NMeH as substrate assessed as formazan formation
J Med Chem 53: 8688-99 (2010)
Article DOI: 10.1021/jm1011066
BindingDB Entry DOI: 10.7270/Q2TB178C