BDBM50347478 CHEMBL1802266
SMILES: COc1cc(Br)cc2nc3cc(C)c(C)cc3nc12
InChI Key: InChIKey=JZWLMGCYOWLKCY-UHFFFAOYSA-N
Data: 1 IC50
Activity Spreadsheet -- Enzyme Inhibition Constant Data from BindingDB
Found 1 hit for monomerid = 50347478
Trg + Lig
Ki
nM
ΔG°
kcal/mole
IC50
nM
Kd
nM
EC50/IC50
nM
koff
s-1
kon
M-1s-1
pHTemp
°C
Ribosyldihydronicotinamide dehydrogenase [quinone]
(Homo sapiens (Human))
BDBM50347478
(CHEMBL1802266)
Show SMILES COc1cc(Br)cc2nc3cc(C)c(C)cc3nc12
Show InChI InChI=1S/C15H13BrN2O/c1-8-4-11-12(5-9(8)2)18-15-13(17-11)6-10(16)7-14(15)19-3/h4-7H,1-3H3
n/an/a 1.05E+4n/an/an/an/an/an/a
Purdue University
Curated by ChEMBL
Assay Description
Inhibition of human QR2 expressed in Escherichia coli BL21 (DE3) using MTT and NMeH as substrate assessed as formazan formation
J Med Chem 53: 8688-99 (2010)
Article DOI: 10.1021/jm1011066
BindingDB Entry DOI: 10.7270/Q2TB178C