BDBM50347488 CHEMBL1802205
SMILES: COc1cc(Br)c(Br)c2nc3ccccc3nc12
InChI Key: InChIKey=RHDCTWTUJSDZCE-UHFFFAOYSA-N
Data: 1 IC50
Activity Spreadsheet -- Enzyme Inhibition Constant Data from BindingDB
Found 1 hit for monomerid = 50347488
Trg + Lig
Ki
nM
ΔG°
kcal/mole
IC50
nM
Kd
nM
EC50/IC50
nM
koff
s-1
kon
M-1s-1
pHTemp
°C
Ribosyldihydronicotinamide dehydrogenase [quinone]
(Homo sapiens (Human))
BDBM50347488
(CHEMBL1802205)
Show SMILES COc1cc(Br)c(Br)c2nc3ccccc3nc12
Show InChI InChI=1S/C13H8Br2N2O/c1-18-10-6-7(14)11(15)13-12(10)16-8-4-2-3-5-9(8)17-13/h2-6H,1H3
n/an/a 160n/an/an/an/an/an/a
Purdue University
Curated by ChEMBL
Assay Description
Inhibition of human QR2 expressed in Escherichia coli BL21 (DE3) using MTT and NMeH as substrate assessed as formazan formation
J Med Chem 53: 8688-99 (2010)
Article DOI: 10.1021/jm1011066
BindingDB Entry DOI: 10.7270/Q2TB178C