BDBM50347588 CHEMBL1802025
SMILES: CCc1nn2ccc3OCCc3c2c1CCNC(C)=O
InChI Key: InChIKey=IZDHETWMKYCGAU-UHFFFAOYSA-N
Data: 2 KI  2 EC50
Activity Spreadsheet -- Enzyme Inhibition Constant Data from BindingDB
Found 4 hits for monomerid = 50347588
Trg + Lig
Ki
nM
ΔG°
kcal/mole
IC50
nM
Kd
nM
EC50/IC50
nM
koff
s-1
kon
M-1s-1
pHTemp
°C
Melatonin receptor
(Homo sapiens (Human))
BDBM50347588
(CHEMBL1802025)
Show SMILES CCc1nn2ccc3OCCc3c2c1CCNC(C)=O
Show InChI InChI=1S/C15H19N3O2/c1-3-13-11(4-7-16-10(2)19)15-12-6-9-20-14(12)5-8-18(15)17-13/h5,8H,3-4,6-7,9H2,1-2H3,(H,16,19)
Reactome pathway
0.0620n/an/an/an/an/an/an/an/a
Takeda Pharmaceutical Company Limited
Curated by ChEMBL
Assay Description
Displacement of 2-[125I]iodomelatonin from human MT1 receptor expressed in CHO cells
J Med Chem 54: 4207-18 (2011)
Article DOI: 10.1021/jm200385u
BindingDB Entry DOI: 10.7270/Q2HT2PN3
Melatonin receptor
(Homo sapiens (Human))
BDBM50347588
(CHEMBL1802025)
Show SMILES CCc1nn2ccc3OCCc3c2c1CCNC(C)=O
Show InChI InChI=1S/C15H19N3O2/c1-3-13-11(4-7-16-10(2)19)15-12-6-9-20-14(12)5-8-18(15)17-13/h5,8H,3-4,6-7,9H2,1-2H3,(H,16,19)
Reactome pathway
0.420n/an/an/an/an/an/an/an/a
Takeda Pharmaceutical Company Limited
Curated by ChEMBL
Assay Description
Displacement of 2-[125I]iodomelatonin from human MT2 receptor expressed in CHO cells
J Med Chem 54: 4207-18 (2011)
Article DOI: 10.1021/jm200385u
BindingDB Entry DOI: 10.7270/Q2HT2PN3
Melatonin receptor
(Homo sapiens (Human))
BDBM50347588
(CHEMBL1802025)
Show SMILES CCc1nn2ccc3OCCc3c2c1CCNC(C)=O
Show InChI InChI=1S/C15H19N3O2/c1-3-13-11(4-7-16-10(2)19)15-12-6-9-20-14(12)5-8-18(15)17-13/h5,8H,3-4,6-7,9H2,1-2H3,(H,16,19)
Reactome pathway
n/an/an/an/a 0.530n/an/an/an/a
Takeda Pharmaceutical Company Limited
Curated by ChEMBL
Assay Description
Agonist activity at human MT2 receptor expressed in CHO cells assessed as decrease in forskolin-stimulated cAMP release after 30 mins by multilabel p...
J Med Chem 54: 4207-18 (2011)
Article DOI: 10.1021/jm200385u
BindingDB Entry DOI: 10.7270/Q2HT2PN3
Melatonin receptor
(Homo sapiens (Human))
BDBM50347588
(CHEMBL1802025)
Show SMILES CCc1nn2ccc3OCCc3c2c1CCNC(C)=O
Show InChI InChI=1S/C15H19N3O2/c1-3-13-11(4-7-16-10(2)19)15-12-6-9-20-14(12)5-8-18(15)17-13/h5,8H,3-4,6-7,9H2,1-2H3,(H,16,19)
Reactome pathway
n/an/an/an/a 0.0210n/an/an/an/a
Takeda Pharmaceutical Company Limited
Curated by ChEMBL
Assay Description
Agonist activity at human MT1 receptor expressed in CHO cells assessed as decrease in forskolin-stimulated cAMP release after 30 mins by multilabel p...
J Med Chem 54: 4207-18 (2011)
Article DOI: 10.1021/jm200385u
BindingDB Entry DOI: 10.7270/Q2HT2PN3