BDBM50347657 CHEMBL1615181
SMILES: O=C(CCc1ccc2ccc3ncc(cc3c(=O)c2c1)-c1cnn(c1)C1CCNCC1)NCc1ccccn1
InChI Key: InChIKey=PCKOOTOQVCFRHS-UHFFFAOYSA-N
Data: 2 IC50
PDB links: 1 PDB ID matches this monomer.
Activity Spreadsheet -- Enzyme Inhibition Constant Data from BindingDB
Found 2 hits for monomerid = 50347657
Trg + Lig
Ki
nM
ΔG°
kcal/mole
IC50
nM
Kd
nM
EC50/IC50
nM
koff
s-1
kon
M-1s-1
pHTemp
°C
Hepatocyte growth factor receptor
(Homo sapiens (Human))
BDBM50347657
(CHEMBL1615181)
Show SMILES O=C(CCc1ccc2ccc3ncc(cc3c(=O)c2c1)-c1cnn(c1)C1CCNCC1)NCc1ccccn1
Show InChI InChI=1S/C31H30N6O2/c38-30(35-19-25-3-1-2-12-33-25)9-5-21-4-6-22-7-8-29-28(31(39)27(22)15-21)16-23(17-34-29)24-18-36-37(20-24)26-10-13-32-14-11-26/h1-4,6-8,12,15-18,20,26,32H,5,9-11,13-14,19H2,(H,35,38)
n/an/a 28n/an/an/an/an/an/a
Merck Research Laboratories
Curated by ChEMBL
Assay Description
Inhibition of human recombinant c-Met-catalyzed phosphorylation of N-biotinylated peptide (EQEDEPEGDYFEWLE-CONH2) by time-resolved fluorescence reson...
J Med Chem 54: 4092-108 (2011)
Article DOI: 10.1021/jm200112k
BindingDB Entry DOI: 10.7270/Q2X34ZFZ
3D
3D Structure (crystal)
Hepatocyte growth factor receptor
(Homo sapiens (Human))
BDBM50347657
(CHEMBL1615181)
Show SMILES O=C(CCc1ccc2ccc3ncc(cc3c(=O)c2c1)-c1cnn(c1)C1CCNCC1)NCc1ccccn1
Show InChI InChI=1S/C31H30N6O2/c38-30(35-19-25-3-1-2-12-33-25)9-5-21-4-6-22-7-8-29-28(31(39)27(22)15-21)16-23(17-34-29)24-18-36-37(20-24)26-10-13-32-14-11-26/h1-4,6-8,12,15-18,20,26,32H,5,9-11,13-14,19H2,(H,35,38)
n/an/a 85n/an/an/an/an/an/a
Merck& Co., Inc.
Curated by ChEMBL
Assay Description
Inhibition of c-MET (unknown origin)-catalyzed N-biotinylated EQEDEPEGDYFEWLECONH2 phosphorylation by TR-FRET assay
J Med Chem 56: 2294-310 (2013)
Article DOI: 10.1021/jm301619u
BindingDB Entry DOI: 10.7270/Q21837VX
3D
3D Structure (crystal)