BDBM50347668 CHEMBL1802908
SMILES: CCN(CC)S(=O)(=O)Nc1ccc2ccc3ncc(cc3c(=O)c2c1)-c1cnn(C)c1
InChI Key: InChIKey=AEOVORPOZVUOMW-UHFFFAOYSA-N
Data: 3 IC50
Activity Spreadsheet -- Enzyme Inhibition Constant Data from BindingDB
Found 3 hits for monomerid = 50347668
Trg + Lig
Ki
nM
ΔG°
kcal/mole
IC50
nM
Kd
nM
EC50/IC50
nM
koff
s-1
kon
M-1s-1
pHTemp
°C
Potassium voltage-gated channel subfamily H member 2
(Homo sapiens (Human))
BDBM50347668
(CHEMBL1802908)
Show SMILES CCN(CC)S(=O)(=O)Nc1ccc2ccc3ncc(cc3c(=O)c2c1)-c1cnn(C)c1
Show InChI InChI=1S/C22H23N5O3S/c1-4-27(5-2)31(29,30)25-18-8-6-15-7-9-21-20(22(28)19(15)11-18)10-16(12-23-21)17-13-24-26(3)14-17/h6-14,25H,4-5H2,1-3H3
Reactome pathway
n/an/a>3.00E+4n/an/an/an/an/an/a
Merck Research Laboratories
Curated by ChEMBL
Assay Description
Inhibition of Kv11.1 channel
J Med Chem 54: 4092-108 (2011)
Article DOI: 10.1021/jm200112k
BindingDB Entry DOI: 10.7270/Q2X34ZFZ
Hepatocyte growth factor receptor
(Homo sapiens (Human))
BDBM50347668
(CHEMBL1802908)
Show SMILES CCN(CC)S(=O)(=O)Nc1ccc2ccc3ncc(cc3c(=O)c2c1)-c1cnn(C)c1
Show InChI InChI=1S/C22H23N5O3S/c1-4-27(5-2)31(29,30)25-18-8-6-15-7-9-21-20(22(28)19(15)11-18)10-16(12-23-21)17-13-24-26(3)14-17/h6-14,25H,4-5H2,1-3H3
n/an/a 4n/an/an/an/an/an/a
Merck Research Laboratories
Curated by ChEMBL
Assay Description
Inhibition of human recombinant c-Met-catalyzed phosphorylation of N-biotinylated peptide (EQEDEPEGDYFEWLE-CONH2) by time-resolved fluorescence reson...
J Med Chem 54: 4092-108 (2011)
Article DOI: 10.1021/jm200112k
BindingDB Entry DOI: 10.7270/Q2X34ZFZ
Hepatocyte growth factor receptor
(Homo sapiens (Human))
BDBM50347668
(CHEMBL1802908)
Show SMILES CCN(CC)S(=O)(=O)Nc1ccc2ccc3ncc(cc3c(=O)c2c1)-c1cnn(C)c1
Show InChI InChI=1S/C22H23N5O3S/c1-4-27(5-2)31(29,30)25-18-8-6-15-7-9-21-20(22(28)19(15)11-18)10-16(12-23-21)17-13-24-26(3)14-17/h6-14,25H,4-5H2,1-3H3
n/an/a 110n/an/an/an/an/an/a
Merck Research Laboratories
Curated by ChEMBL
Assay Description
Inhibition of c-MET overexpressed in human GTL-16 cells assessed as phosphorylation at C-terminal Y1349 after 2 hrs by Western blot analysis
J Med Chem 54: 4092-108 (2011)
Article DOI: 10.1021/jm200112k
BindingDB Entry DOI: 10.7270/Q2X34ZFZ