BDBM50347676 CHEMBL1802834
SMILES: CN(C)S(=O)(=O)Nc1ccc2ccc3ncc(cc3c(=O)c2c1)-c1cnn(CCF)c1
InChI Key: InChIKey=ILICPPXYSXACBA-UHFFFAOYSA-N
Data: 2 IC50
Activity Spreadsheet -- Enzyme Inhibition Constant Data from BindingDB
Found 2 hits for monomerid = 50347676
Trg + Lig
Ki
nM
ΔG°
kcal/mole
IC50
nM
Kd
nM
EC50/IC50
nM
koff
s-1
kon
M-1s-1
pHTemp
°C
Hepatocyte growth factor receptor
(Homo sapiens (Human))
BDBM50347676
(CHEMBL1802834)
Show SMILES CN(C)S(=O)(=O)Nc1ccc2ccc3ncc(cc3c(=O)c2c1)-c1cnn(CCF)c1
Show InChI InChI=1S/C21H20FN5O3S/c1-26(2)31(29,30)25-17-5-3-14-4-6-20-19(21(28)18(14)10-17)9-15(11-23-20)16-12-24-27(13-16)8-7-22/h3-6,9-13,25H,7-8H2,1-2H3
n/an/a 40n/an/an/an/an/an/a
Merck Research Laboratories
Curated by ChEMBL
Assay Description
Inhibition of c-MET overexpressed in human GTL-16 cells assessed as phosphorylation at C-terminal Y1349 after 2 hrs by Western blot analysis
J Med Chem 54: 4092-108 (2011)
Article DOI: 10.1021/jm200112k
BindingDB Entry DOI: 10.7270/Q2X34ZFZ
Hepatocyte growth factor receptor
(Homo sapiens (Human))
BDBM50347676
(CHEMBL1802834)
Show SMILES CN(C)S(=O)(=O)Nc1ccc2ccc3ncc(cc3c(=O)c2c1)-c1cnn(CCF)c1
Show InChI InChI=1S/C21H20FN5O3S/c1-26(2)31(29,30)25-17-5-3-14-4-6-20-19(21(28)18(14)10-17)9-15(11-23-20)16-12-24-27(13-16)8-7-22/h3-6,9-13,25H,7-8H2,1-2H3
n/an/a 3n/an/an/an/an/an/a
Merck Research Laboratories
Curated by ChEMBL
Assay Description
Inhibition of human recombinant c-Met-catalyzed phosphorylation of N-biotinylated peptide (EQEDEPEGDYFEWLE-CONH2) by time-resolved fluorescence reson...
J Med Chem 54: 4092-108 (2011)
Article DOI: 10.1021/jm200112k
BindingDB Entry DOI: 10.7270/Q2X34ZFZ