BDBM50347701 CHEMBL1802598
SMILES: CS(=O)(=O)Nc1ccc2ccc3ncc(cc3c(=O)c2c1)-c1ccoc1
InChI Key: InChIKey=XRRQCPBNRJQAMX-UHFFFAOYSA-N
Data: 2 IC50
Activity Spreadsheet -- Enzyme Inhibition Constant Data from BindingDB
Found 2 hits for monomerid = 50347701
Trg + Lig
Ki
nM
ΔG°
kcal/mole
IC50
nM
Kd
nM
EC50/IC50
nM
koff
s-1
kon
M-1s-1
pHTemp
°C
Hepatocyte growth factor receptor
(Homo sapiens (Human))
BDBM50347701
(CHEMBL1802598)
Show SMILES CS(=O)(=O)Nc1ccc2ccc3ncc(cc3c(=O)c2c1)-c1ccoc1
Show InChI InChI=1S/C19H14N2O4S/c1-26(23,24)21-15-4-2-12-3-5-18-17(19(22)16(12)9-15)8-14(10-20-18)13-6-7-25-11-13/h2-11,21H,1H3
n/an/a 64n/an/an/an/an/an/a
Merck Research Laboratories
Curated by ChEMBL
Assay Description
Inhibition of human recombinant c-Met-catalyzed phosphorylation of N-biotinylated peptide (EQEDEPEGDYFEWLE-CONH2) by time-resolved fluorescence reson...
J Med Chem 54: 4092-108 (2011)
Article DOI: 10.1021/jm200112k
BindingDB Entry DOI: 10.7270/Q2X34ZFZ
Hepatocyte growth factor receptor
(Homo sapiens (Human))
BDBM50347701
(CHEMBL1802598)
Show SMILES CS(=O)(=O)Nc1ccc2ccc3ncc(cc3c(=O)c2c1)-c1ccoc1
Show InChI InChI=1S/C19H14N2O4S/c1-26(23,24)21-15-4-2-12-3-5-18-17(19(22)16(12)9-15)8-14(10-20-18)13-6-7-25-11-13/h2-11,21H,1H3
n/an/a 5.50E+3n/an/an/an/an/an/a
Merck Research Laboratories
Curated by ChEMBL
Assay Description
Inhibition of c-MET overexpressed in human GTL-16 cells assessed as phosphorylation at C-terminal Y1349 after 2 hrs by Western blot analysis
J Med Chem 54: 4092-108 (2011)
Article DOI: 10.1021/jm200112k
BindingDB Entry DOI: 10.7270/Q2X34ZFZ