BDBM50347729 CHEMBL1802763
SMILES: OC(=O)\C=C\c1cccc(Nc2cnc3ccccc3n2)c1
InChI Key: InChIKey=VUKKKRTYXGZLFP-CMDGGOBGSA-N
Data: 1 IC50
Activity Spreadsheet -- Enzyme Inhibition Constant Data from BindingDB
Found 1 hit for monomerid = 50347729
Trg + Lig
Ki
nM
ΔG°
kcal/mole
IC50
nM
Kd
nM
EC50/IC50
nM
koff
s-1
kon
M-1s-1
pHTemp
°C
Transforming protein RhoA
(Homo sapiens (Human))
BDBM50347729
(CHEMBL1802763)
Show SMILES OC(=O)\C=C\c1cccc(Nc2cnc3ccccc3n2)c1
Show InChI InChI=1S/C17H13N3O2/c21-17(22)9-8-12-4-3-5-13(10-12)19-16-11-18-14-6-1-2-7-15(14)20-16/h1-11H,(H,19,20)(H,21,22)/b9-8+
Reactome pathway
n/an/a 1.51E+3n/an/an/an/an/an/a
East China University of Science and Technology
Curated by ChEMBL
Assay Description
Inhibition of rhoA expressed in Escherichia coli BL21 after 1 hr by G-LISA activation based chemiluminiscence assay
J Med Chem 54: 4508-22 (2011)
Article DOI: 10.1021/jm200161c
BindingDB Entry DOI: 10.7270/Q2C53M61