null
SMILES: [#6]-[#6](-[#6])-[#6]-[#6@H](-[#7]-[#6](=O)-[#6@@H]-1-[#6]-[#6]-[#6]-[#7]-1-[#6](=O)-[#6]-[#7]-[#6](=O)-[#6@H](-[#6]-[#8])-[#7]-[#6](=O)-[#6@H](-[#6])-[#7])-[#6](=O)-[#7]-[#6]-[#6](=O)-[#7]-[#6@@H](-[#6@@H](-[#6])-[#8])-[#6](=O)-[#7]-[#6@@H](-[#6]-[#6](-[#6])-[#6])-[#6](=O)-[#7]-[#6@@H](-[#6])-[#6](=O)-[#7]-[#6@@H](-[#6]-[#6]-[#6](-[#8])=O)-[#6](=O)-[#7]-[#6@@H](-[#6]-[#6]-[#6](-[#8])=O)-[#6](=O)-[#7]-[#6@@H](-[#6]-[#6](-[#6])-[#6])-[#6](=O)-[#7]-[#6@@H](-[#6]-[#8])-[#6](=O)-[#7]-[#6@@H](-[#6]-[#8])-[#6](=O)-[#7]-[#6@@H](-[#6]-c1ccc(-[#8])cc1)-[#6](=O)-[#7]-[#6@@H](-[#6]-[#8])-[#6](=O)-[#7]-[#6@@H](-[#6]-[#6]-[#6]\[#7]=[#6](/[#7])-[#7])-[#6](=O)-[#7]-[#6@@H](-[#6]-[#6]-[#6]\[#7]=[#6](/[#7])-[#7])-[#6](=O)-[#7]-[#6@@H](-[#6]-[#6]-[#6]-[#6]-[#7])-[#6](=O)-[#7]-[#6]-[#6](=O)-[#7]-[#6]-[#6](=O)-[#7]-[#6@@H](-[#6]-c1ccccc1)-[#6](=O)-[#7]-[#6@@H](-[#6]-[#8])-[#6](=O)-[#7]-[#6@@H](-[#6]-c1ccccc1)-[#6](=O)-[#7]-[#6@@H](-[#6]-[#6]-[#6]\[#7]=[#6](/[#7])-[#7])-[#6](=O)-[#7]-[#6@@H](-[#6]-c1ccccc1)-[#6](-[#7])=O
InChI Key: InChIKey=GZORTMDPMZLEID-JHPUGHCGSA-N
Activity Spreadsheet -- Enzyme Inhibition Constant Data from BindingDB
Found 2 hits for monomerid = 50347819
Trg + Lig
Ki
nM
ΔG°
kcal/mole
IC50
nM
Kd
nM
EC50/IC50
nM
koff
s-1
kon
M-1s-1
pHTemp
°C
Pyroglutamylated RF-amide peptide receptor
(Homo sapiens (Human))
BDBM50347819
(CHEMBL1802414 | P550)
Show SMILES [#6]-[#6](-[#6])-[#6]-[#6@H](-[#7]-[#6](=O)-[#6@@H]-1-[#6]-[#6]-[#6]-[#7]-1-[#6](=O)-[#6]-[#7]-[#6](=O)-[#6@H](-[#6]-[#8])-[#7]-[#6](=O)-[#6@H](-[#6])-[#7])-[#6](=O)-[#7]-[#6]-[#6](=O)-[#7]-[#6@@H](-[#6@@H](-[#6])-[#8])-[#6](=O)-[#7]-[#6@@H](-[#6]-[#6](-[#6])-[#6])-[#6](=O)-[#7]-[#6@@H](-[#6])-[#6](=O)-[#7]-[#6@@H](-[#6]-[#6]-[#6](-[#8])=O)-[#6](=O)-[#7]-[#6@@H](-[#6]-[#6]-[#6](-[#8])=O)-[#6](=O)-[#7]-[#6@@H](-[#6]-[#6](-[#6])-[#6])-[#6](=O)-[#7]-[#6@@H](-[#6]-[#8])-[#6](=O)-[#7]-[#6@@H](-[#6]-[#8])-[#6](=O)-[#7]-[#6@@H](-[#6]-c1ccc(-[#8])cc1)-[#6](=O)-[#7]-[#6@@H](-[#6]-[#8])-[#6](=O)-[#7]-[#6@@H](-[#6]-[#6]-[#6]\[#7]=[#6](/[#7])-[#7])-[#6](=O)-[#7]-[#6@@H](-[#6]-[#6]-[#6]\[#7]=[#6](/[#7])-[#7])-[#6](=O)-[#7]-[#6@@H](-[#6]-[#6]-[#6]-[#6]-[#7])-[#6](=O)-[#7]-[#6]-[#6](=O)-[#7]-[#6]-[#6](=O)-[#7]-[#6@@H](-[#6]-c1ccccc1)-[#6](=O)-[#7]-[#6@@H](-[#6]-[#8])-[#6](=O)-[#7]-[#6@@H](-[#6]-c1ccccc1)-[#6](=O)-[#7]-[#6@@H](-[#6]-[#6]-[#6]\[#7]=[#6](/[#7])-[#7])-[#6](=O)-[#7]-[#6@@H](-[#6]-c1ccccc1)-[#6](-[#7])=O |r|
Show InChI InChI=1S/C126H195N37O37/c1-65(2)49-83(155-122(199)94-35-24-48-163(94)98(174)59-142-107(184)89(60-164)157-103(180)68(7)128)106(183)141-58-97(173)162-101(70(9)169)123(200)156-84(50-66(3)4)113(190)143-69(8)104(181)145-80(40-42-99(175)176)111(188)150-81(41-43-100(177)178)112(189)152-85(51-67(5)6)114(191)158-93(64-168)121(198)161-92(63-167)120(197)154-88(55-74-36-38-75(170)39-37-74)117(194)160-90(61-165)118(195)149-78(33-22-46-137-125(132)133)109(186)147-77(32-21-45-136-124(130)131)108(185)146-76(31-19-20-44-127)105(182)140-56-95(171)139-57-96(172)144-86(53-72-27-15-11-16-28-72)115(192)159-91(62-166)119(196)153-87(54-73-29-17-12-18-30-73)116(193)148-79(34-23-47-138-126(134)135)110(187)151-82(102(129)179)52-71-25-13-10-14-26-71/h10-18,25-30,36-39,65-70,76-94,101,164-170H,19-24,31-35,40-64,127-128H2,1-9H3,(H2,129,179)(H,139,171)(H,140,182)(H,141,183)(H,142,184)(H,143,190)(H,144,172)(H,145,181)(H,146,185)(H,147,186)(H,148,193)(H,149,195)(H,150,188)(H,151,187)(H,152,189)(H,153,196)(H,154,197)(H,155,199)(H,156,200)(H,157,180)(H,158,191)(H,159,192)(H,160,194)(H,161,198)(H,162,173)(H,175,176)(H,177,178)(H4,130,131,136)(H4,132,133,137)(H4,134,135,138)/t68-,69-,70+,76-,77-,78-,79-,80-,81-,82-,83-,84-,85-,86-,87-,88-,89-,90-,91-,92-,93-,94-,101-/m0/s1
6n/an/an/an/an/an/an/an/a
Schering-Plough Research Institute
Curated by PDSP Ki Database
J Biol Chem 278: 27652-7 (2003)
Article DOI: 10.1074/jbc.M302945200
BindingDB Entry DOI: 10.7270/Q2ZK5F81
Pyroglutamylated RF-amide peptide receptor
(Homo sapiens (Human))
BDBM50347819
(CHEMBL1802414 | P550)
Show SMILES [#6]-[#6](-[#6])-[#6]-[#6@H](-[#7]-[#6](=O)-[#6@@H]-1-[#6]-[#6]-[#6]-[#7]-1-[#6](=O)-[#6]-[#7]-[#6](=O)-[#6@H](-[#6]-[#8])-[#7]-[#6](=O)-[#6@H](-[#6])-[#7])-[#6](=O)-[#7]-[#6]-[#6](=O)-[#7]-[#6@@H](-[#6@@H](-[#6])-[#8])-[#6](=O)-[#7]-[#6@@H](-[#6]-[#6](-[#6])-[#6])-[#6](=O)-[#7]-[#6@@H](-[#6])-[#6](=O)-[#7]-[#6@@H](-[#6]-[#6]-[#6](-[#8])=O)-[#6](=O)-[#7]-[#6@@H](-[#6]-[#6]-[#6](-[#8])=O)-[#6](=O)-[#7]-[#6@@H](-[#6]-[#6](-[#6])-[#6])-[#6](=O)-[#7]-[#6@@H](-[#6]-[#8])-[#6](=O)-[#7]-[#6@@H](-[#6]-[#8])-[#6](=O)-[#7]-[#6@@H](-[#6]-c1ccc(-[#8])cc1)-[#6](=O)-[#7]-[#6@@H](-[#6]-[#8])-[#6](=O)-[#7]-[#6@@H](-[#6]-[#6]-[#6]\[#7]=[#6](/[#7])-[#7])-[#6](=O)-[#7]-[#6@@H](-[#6]-[#6]-[#6]\[#7]=[#6](/[#7])-[#7])-[#6](=O)-[#7]-[#6@@H](-[#6]-[#6]-[#6]-[#6]-[#7])-[#6](=O)-[#7]-[#6]-[#6](=O)-[#7]-[#6]-[#6](=O)-[#7]-[#6@@H](-[#6]-c1ccccc1)-[#6](=O)-[#7]-[#6@@H](-[#6]-[#8])-[#6](=O)-[#7]-[#6@@H](-[#6]-c1ccccc1)-[#6](=O)-[#7]-[#6@@H](-[#6]-[#6]-[#6]\[#7]=[#6](/[#7])-[#7])-[#6](=O)-[#7]-[#6@@H](-[#6]-c1ccccc1)-[#6](-[#7])=O |r|
Show InChI InChI=1S/C126H195N37O37/c1-65(2)49-83(155-122(199)94-35-24-48-163(94)98(174)59-142-107(184)89(60-164)157-103(180)68(7)128)106(183)141-58-97(173)162-101(70(9)169)123(200)156-84(50-66(3)4)113(190)143-69(8)104(181)145-80(40-42-99(175)176)111(188)150-81(41-43-100(177)178)112(189)152-85(51-67(5)6)114(191)158-93(64-168)121(198)161-92(63-167)120(197)154-88(55-74-36-38-75(170)39-37-74)117(194)160-90(61-165)118(195)149-78(33-22-46-137-125(132)133)109(186)147-77(32-21-45-136-124(130)131)108(185)146-76(31-19-20-44-127)105(182)140-56-95(171)139-57-96(172)144-86(53-72-27-15-11-16-28-72)115(192)159-91(62-166)119(196)153-87(54-73-29-17-12-18-30-73)116(193)148-79(34-23-47-138-126(134)135)110(187)151-82(102(129)179)52-71-25-13-10-14-26-71/h10-18,25-30,36-39,65-70,76-94,101,164-170H,19-24,31-35,40-64,127-128H2,1-9H3,(H2,129,179)(H,139,171)(H,140,182)(H,141,183)(H,142,184)(H,143,190)(H,144,172)(H,145,181)(H,146,185)(H,147,186)(H,148,193)(H,149,195)(H,150,188)(H,151,187)(H,152,189)(H,153,196)(H,154,197)(H,155,199)(H,156,200)(H,157,180)(H,158,191)(H,159,192)(H,160,194)(H,161,198)(H,162,173)(H,175,176)(H,177,178)(H4,130,131,136)(H4,132,133,137)(H4,134,135,138)/t68-,69-,70+,76-,77-,78-,79-,80-,81-,82-,83-,84-,85-,86-,87-,88-,89-,90-,91-,92-,93-,94-,101-/m0/s1
n/an/an/an/a 4.90n/an/an/an/a
INSERM
Curated by ChEMBL
Assay Description
Agonist activity at DYKDDDDK-flagged human GPR103 receptor expressed in CHO-K1 cells co-expressing G-protein alpha16 assessed as stimulation of calci...
J Med Chem 54: 4806-14 (2011)
Article DOI: 10.1021/jm200418c
BindingDB Entry DOI: 10.7270/Q2V40VJ8