BDBM50347902 CHEMBL1802616
SMILES: COCCCNc1nccc(n1)-c1c(C)[nH]c2ccccc12
InChI Key: InChIKey=MZDDMOLLGAAVBD-UHFFFAOYSA-N
Data: 1 IC50
Activity Spreadsheet -- Enzyme Inhibition Constant Data from BindingDB
Found 1 hit for monomerid = 50347902
Trg + Lig
Ki
nM
ΔG°
kcal/mole
IC50
nM
Kd
nM
EC50/IC50
nM
koff
s-1
kon
M-1s-1
pHTemp
°C
Interferon-induced, double-stranded RNA-activated protein kinase
(Homo sapiens (Human))
BDBM50347902
(CHEMBL1802616)
Show SMILES COCCCNc1nccc(n1)-c1c(C)[nH]c2ccccc12
Show InChI InChI=1S/C17H20N4O/c1-12-16(13-6-3-4-7-14(13)20-12)15-8-10-19-17(21-15)18-9-5-11-22-2/h3-4,6-8,10,20H,5,9,11H2,1-2H3,(H,18,19,21)
NCI pathway
Reactome pathway
n/an/a 1.50E+3n/an/an/an/an/an/a
Weill Cornell Medical College
Curated by ChEMBL
Assay Description
Inhibition of human recombinant PKR autophosphorylation using poly[I:C] after 10 mins by luminescent assay
Bioorg Med Chem Lett 21: 4108-14 (2011)
Article DOI: 10.1016/j.bmcl.2011.04.149
BindingDB Entry DOI: 10.7270/Q2KK9C4H