BDBM50347918 CHEMBL1502303
SMILES: Brc1ccc2[nH]cc(\C=C3/NC(=O)NC3=O)c2c1
InChI Key: InChIKey=PDVPLITVGXYXQU-KMKOMSMNSA-N
Data: 1 IC50
Activity Spreadsheet -- Enzyme Inhibition Constant Data from BindingDB
Found 1 hit for monomerid = 50347918
Trg + Lig
Ki
nM
ΔG°
kcal/mole
IC50
nM
Kd
nM
EC50/IC50
nM
koff
s-1
kon
M-1s-1
pHTemp
°C
Interferon-induced, double-stranded RNA-activated protein kinase
(Homo sapiens (Human))
BDBM50347918
(CHEMBL1502303)
Show SMILES Brc1ccc2[nH]cc(\C=C3/NC(=O)NC3=O)c2c1
Show InChI InChI=1S/C12H8BrN3O2/c13-7-1-2-9-8(4-7)6(5-14-9)3-10-11(17)16-12(18)15-10/h1-5,14H,(H2,15,16,17,18)/b10-3-
NCI pathway
Reactome pathway
n/an/a 4.00E+3n/an/an/an/an/an/a
Weill Cornell Medical College
Curated by ChEMBL
Assay Description
Inhibition of human recombinant PKR autophosphorylation using poly[I:C] after 10 mins by luminescent assay
Bioorg Med Chem Lett 21: 4108-14 (2011)
Article DOI: 10.1016/j.bmcl.2011.04.149
BindingDB Entry DOI: 10.7270/Q2KK9C4H