BDBM50347926 CHEMBL1802778
SMILES: Cc1[nH]c2ccccc2c1-c1ccnc(Nc2ccc(F)cc2)n1
InChI Key: InChIKey=MHFAEQWEFZACHX-UHFFFAOYSA-N
Data: 1 IC50
Activity Spreadsheet -- Enzyme Inhibition Constant Data from BindingDB
Found 1 hit for monomerid = 50347926
Trg + Lig
Ki
nM
ΔG°
kcal/mole
IC50
nM
Kd
nM
EC50/IC50
nM
koff
s-1
kon
M-1s-1
pHTemp
°C
Interferon-induced, double-stranded RNA-activated protein kinase
(Homo sapiens (Human))
BDBM50347926
(CHEMBL1802778)
Show SMILES Cc1[nH]c2ccccc2c1-c1ccnc(Nc2ccc(F)cc2)n1
Show InChI InChI=1S/C19H15FN4/c1-12-18(15-4-2-3-5-16(15)22-12)17-10-11-21-19(24-17)23-14-8-6-13(20)7-9-14/h2-11,22H,1H3,(H,21,23,24)
NCI pathway
Reactome pathway
n/an/a 150n/an/an/an/an/an/a
Weill Cornell Medical College
Curated by ChEMBL
Assay Description
Inhibition of human recombinant PKR autophosphorylation using poly[I:C] after 10 mins by luminescent assay
Bioorg Med Chem Lett 21: 4108-14 (2011)
Article DOI: 10.1016/j.bmcl.2011.04.149
BindingDB Entry DOI: 10.7270/Q2KK9C4H