null
SMILES: COCCN(C)Cc1c(sc2n(Cc3c(F)cccc3F)c(=O)n(CC(C)(C)O)c(=O)c12)-c1ccc(NC(=O)NOC)cc1
InChI Key: InChIKey=HMQGLDJTYFDJPH-UHFFFAOYSA-N
Activity Spreadsheet -- Enzyme Inhibition Constant Data from BindingDB
Found 1 hit for monomerid = 50347998
Trg + Lig
Ki
nM
ΔG°
kcal/mole
IC50
nM
Kd
nM
EC50/IC50
nM
koff
s-1
kon
M-1s-1
pHTemp
°C
Gonadotropin-releasing hormone receptor
(Homo sapiens (Human))
BDBM50347998
(CHEMBL1800151)
Show SMILES COCCN(C)Cc1c(sc2n(Cc3c(F)cccc3F)c(=O)n(CC(C)(C)O)c(=O)c12)-c1ccc(NC(=O)NOC)cc1
Show InChI InChI=1S/C30H35F2N5O6S/c1-30(2,41)17-37-26(38)24-21(15-35(3)13-14-42-4)25(18-9-11-19(12-10-18)33-28(39)34-43-5)44-27(24)36(29(37)40)16-20-22(31)7-6-8-23(20)32/h6-12,41H,13-17H2,1-5H3,(H2,33,34,39)
n/an/a 0.300n/an/an/an/an/an/a
Takeda Pharmaceutical Company, Ltd.
Curated by ChEMBL
Assay Description
Displacement of [125I]leuprorelin from recombinant human GnRH receptor expressed in CHO cells after 60 mins by X-ray counter
J Med Chem 54: 4998-5012 (2011)
Article DOI: 10.1021/jm200216q
BindingDB Entry DOI: 10.7270/Q22N52MK