BDBM50348020 CHEMBL1800417
SMILES: Cc1cccc(NCCC2(CCOC(C)(C)C2)c2ccccc2)c1
InChI Key: InChIKey=OOHOVJKNQNTSOG-UHFFFAOYSA-N
Data: 1 IC50
Activity Spreadsheet -- Enzyme Inhibition Constant Data from BindingDB
Found 1 hit for monomerid = 50348020
Trg + Lig
Ki
nM
ΔG°
kcal/mole
IC50
nM
Kd
nM
EC50/IC50
nM
koff
s-1
kon
M-1s-1
pHTemp
°C
Isoprenylcysteine carboxyl methyltransferase
(Homo sapiens (Human))
BDBM50348020
(CHEMBL1800417)
Show SMILES Cc1cccc(NCCC2(CCOC(C)(C)C2)c2ccccc2)c1
Show InChI InChI=1S/C22H29NO/c1-18-8-7-11-20(16-18)23-14-12-22(19-9-5-4-6-10-19)13-15-24-21(2,3)17-22/h4-11,16,23H,12-15,17H2,1-3H3
n/an/a 31n/an/an/an/an/an/a
Myrexis, Inc.
Curated by ChEMBL
Assay Description
Inhibition of human recombinant C-terminal His6-tagged ICMT assessed as methylation of N-acetyl-S-geranylgeranylcysteine using SAM as methyl donor su...
J Med Chem 54: 5031-47 (2011)
Article DOI: 10.1021/jm200249a
BindingDB Entry DOI: 10.7270/Q2XW4K49