BDBM50348022 CHEMBL1800419
SMILES: Cc1ccc(NCCC2(CCOC(C)(C)C2)c2ccccc2)cc1C
InChI Key: InChIKey=GFBPGVKTFGUQFZ-UHFFFAOYSA-N
Data: 1 IC50
Activity Spreadsheet -- Enzyme Inhibition Constant Data from BindingDB
Found 1 hit for monomerid = 50348022
Trg + Lig
Ki
nM
ΔG°
kcal/mole
IC50
nM
Kd
nM
EC50/IC50
nM
koff
s-1
kon
M-1s-1
pHTemp
°C
Isoprenylcysteine carboxyl methyltransferase
(Homo sapiens (Human))
BDBM50348022
(CHEMBL1800419)
Show SMILES Cc1ccc(NCCC2(CCOC(C)(C)C2)c2ccccc2)cc1C
Show InChI InChI=1S/C23H31NO/c1-18-10-11-21(16-19(18)2)24-14-12-23(20-8-6-5-7-9-20)13-15-25-22(3,4)17-23/h5-11,16,24H,12-15,17H2,1-4H3
n/an/a 69n/an/an/an/an/an/a
Myrexis, Inc.
Curated by ChEMBL
Assay Description
Inhibition of human recombinant C-terminal His6-tagged ICMT assessed as methylation of N-acetyl-S-geranylgeranylcysteine using SAM as methyl donor su...
J Med Chem 54: 5031-47 (2011)
Article DOI: 10.1021/jm200249a
BindingDB Entry DOI: 10.7270/Q2XW4K49